{"text_format":"3","workbook":"xlsx","n_sheets":23,"sheets":["Admin_Panel","AGS_Namen","Integrationsmonitoring","Impressum","Inhaltsverzeichnis","Methodische Vorbemerkungen","A1","A2","A3","A4","A5","A7","A9","A10","A15","A17","A22","B2","B3","B5","C4","D2","D3"],"not_rendered":{"images":137,"macros":1,"defined_names":28},"read":"whole","date_system":"1900"}

{"sheet":"Admin_Panel","index":0,"n_rows":0,"n_cols":0,"rows_kept":0,"hidden":true}

{"sheet":"AGS_Namen","index":1,"n_rows":58,"n_cols":4,"rows_kept":58,"hidden":true}
[null,null,101,"Braunschweig, Stadt"]
[null,null,102,"Salzgitter, Stadt"]
[null,null,103,"Wolfsburg, Stadt"]
[null,null,151,"Gifhorn"]
[null,null,152,"Göttingen (bis 31.10.2016)"]
[null,null,153,"Goslar"]
[null,null,154,"Helmstedt"]
[null,null,155,"Northeim"]
[null,null,156,"Osterode am Harz (bis 31.10.2016)"]
[null,null,157,"Peine"]
[null,null,158,"Wolfenbüttel"]
[null,null,159,"Göttingen"]
[null,null,159016,"   dav. Göttingen, Stadt"]
[null,null,159999,"   dav. Göttingen, Umland"]
[null,null,1,"Stat. Region Braunschweig"]
[null,null,241,"Hannover, Region"]
[null,null,241001,"   dav. Hannover, Lhst."]
[null,null,241999,"   dav. Hannover, Umland"]
[null,null,251,"Diepholz"]
[null,null,252,"Hameln-Pyrmont"]
[null,null,254,"Hildesheim"]
[null,null,254021,"Hildesheim, Stadt"]
[null,null,254999,"Hildesheim, Umland"]
[null,null,255,"Holzminden"]
[null,null,256,"Nienburg (Weser)"]
[null,null,257,"Schaumburg"]
[null,null,2,"Stat. Region Hannover"]
[null,null,351,"Celle"]
[null,null,352,"Cuxhaven"]
[null,null,353,"Harburg"]
[null,null,354,"Lüchow-Dannenberg"]
[null,null,355,"Lüneburg"]
[null,null,356,"Osterholz"]
[null,null,357,"Rotenburg (Wümme)"]
[null,null,358,"Heidekreis"]
[null,null,359,"Stade"]
[null,null,360,"Uelzen"]
[null,null,361,"Verden"]
[null,null,3,"Stat. Region Lüneburg"]
[null,null,401,"Delmenhorst, Stadt"]
[null,null,402,"Emden, Stadt"]
[null,null,403,"Oldenburg (Oldb), Stadt"]
[null,null,404,"Osnabrück, Stadt"]
[null,null,405,"Wilhelmshaven, Stadt"]
[null,null,451,"Ammerland"]
[null,null,452,"Aurich"]
[null,null,453,"Cloppenburg"]
[null,null,454,"Emsland"]
[null,null,455,"Friesland"]
[null,null,456,"Grafschaft Bentheim"]
[null,null,457,"Leer"]
[null,null,458,"Oldenburg"]
[null,null,459,"Osnabrück"]
[null,null,460,"Vechta"]
[null,null,461,"Wesermarsch"]
[null,null,462,"Wittmund"]
[null,null,4,"Stat. Region Weser-Ems"]
[null,null,0,"Niedersachsen"]

{"sheet":"Integrationsmonitoring","index":2,"n_rows":1,"n_cols":2,"rows_kept":1,"merged":[[0,1,0,9],[46,1,46,3]]}
[null,"Migration und Teilhabe in Niedersachsen - Integrationsmonitoring 2020 - Regionalinformationen "]

{"sheet":"Impressum","index":3,"n_rows":42,"n_cols":4,"rows_kept":42}
[null,{"$f":"Kopf","v":"Migration und Teilhabe in Niedersachsen - Integrationsmonitoring 2020 - Regionalinformationen "}]
[]
[]
[]
[]
[]
[]
[null,"Zeichenerklärung"]
[]
[null,"–","=","Nichts vorhanden"]
[null,0,"=","Mehr als nichts, aber weniger als die Hälfte der kleinsten dargestellten Einheit."]
[null,".","=","Zahlenwert unbekannt oder aus Geheimhaltungsgründen nicht veröffentlicht."]
[null,"x","=","Nachweis ist nicht sinnvoll, unmöglich oder Fragestellung trifft nicht zu."]
[null,"/","=","Nicht veröffentlicht, weil nicht ausreichend genau oder nicht repräsentativ."]
[null,"()","=","Aussagewert eingeschränkt, da der Zahlenwert statistisch relativ unsicher ist."]
[null,"dav.","=","davon. Mit diesem Wort wird die Aufgliederung einer Gesamtmasse in sämtliche Teilmassen eingeleitet."]
[null,"dar.","=","darunter. Mit diesem Wort wird die Ausgliederung einzelner Teilmassen angekündigt."]
[null,"€","=","Euro"]
[]
[null,"Abkürzungsverzeichnis"]
[]
[null,"AZR","=","Ausländerzentralregister"]
[null,"EP","=","Erwerbspersonen"]
[null,"EU","=","Europäische Union"]
[null,"EWR","=","Europäischer Wirtschaftsraum"]
[null,"IntMK","=","Konferenz der für Integration zuständigen Ministerinnen und Minister / Senatorinnen und Senatoren der Länder"]
[null,"NUTS","=","Systematik der Gebietseinheiten für die Statistik (Nomenclature des unités territoriales statistiques, NUTS)"]
[null,"OECD","=","Organisation für wirtschaftliche Zusammenarbeit und Entwicklung (Organisation for Economic Co-operation and Development, OECD)"]
[null,"SGB","=","Sozialgesetzbuch"]
[]
[null,"Impressum"]
[]
[null,"Niedersächsisches Ministerium für Soziales, Gesundheit und Gleichstellung (Hrsg.)"]
[null,"Hannah-Arendt-Platz 2"]
[null,"30159 Hannover"]
[null,"www.ms.niedersachsen.de"]
[null,"Erstellt im Landesamt für Statistik Niedersachsen (LSN)"]
[null,"unter der Leitung von Dr. Christoph Biester"]
[null,"www.statistik.niedersachsen.de"]
[null,"Erschienen im Dezember 2020"]
[null,"© Landesamt für Statistik Niedersachsen, Hannover 2020"]
[null,"Vervielfältigung und Verbreitung, auch auszugsweise, mit Quellenangabe gestattet"]

{"sheet":"Inhaltsverzeichnis","index":4,"n_rows":38,"n_cols":3,"rows_kept":38,"merged":[[6,2,6,9],[8,2,8,6],[8,7,8,9],[9,4,9,9],[12,2,12,12],[13,2,13,12],[14,2,14,12],[15,2,15,12],[16,2,16,12],[17,2,17,12],[18,2,18,12],[19,2,19,12],[20,2,20,12],[21,2,21,12],[22,2,22,12],[26,2,26,12],[27,2,27,12],[28,2,28,12],[32,2,32,12],[36,2,36,12],[37,2,37,12]]}
[null,{"$f":"Kopf","v":"Migration und Teilhabe in Niedersachsen - Integrationsmonitoring 2020 - Regionalinformationen "}]
[]
[]
[]
[]
[]
[null,null,"Inhaltsverzeichnis"]
[]
[null,null,"Methodische Vorbemerkungen"]
[]
[null,null,"A | Bevölkerung"]
[]
[null,null,{"$f":"A1_UE","v":"Indikator A1: Bevölkerung in Niedersachsen "}]
[null,null,{"$f":"A2_UE","v":"Indikator A2: Ausländerinnen und Ausländer in Niedersachsen "}]
[null,null,{"$f":"A3_UE","v":"Indikator A3: Ausländerinnen und Ausländer in Niedersachsen nach Aufenthaltsdauer"}]
[null,null,{"$f":"A4_UE","v":"Indikator A4: Ausländerinnen und Ausländer nach ausgewählten Staatsangehörigkeiten"}]
[null,null,{"$f":"A5_UE","v":"Indikator A5: Geflüchtete und geduldete Personen in Niedersachsen"}]
[null,null,{"$f":"A7_UE","v":"Indikator A7: Ausländerinnen und Ausländer nach Altersgruppen "}]
[null,null,{"$f":"A9_UE","v":"Indikator A9: Ausländerinnen und Ausländer nach Aufenthaltsstatus"}]
[null,null,{"$f":"A10_UE","v":"Indikator A10: Menschen mit Zuwanderungsgeschichte"}]
[null,null,{"$f":"A15_UE","v":"Indikator A15: Einbürgerungen in Niedersachsen"}]
[null,null,{"$f":"A17_UE","v":"Indikator A17: Lebendgeborene Deutsche und Ausländerinnen und Ausländer in Niedersachsen"}]
[null,null,{"$f":"A22_UE","v":"Indikator A22: Saldo der Zu- und Fortzüge über die Bundesgrenzen von und nach Niedersachsen"}]
[]
[null,null,"B | Bildung und Qualifikation"]
[]
[null,null,{"$f":"B2_UE","v":"Indikator B2: Anteil der betreuten Kinder bis unter 6 Jahren mit Zuwanderungsgeschichte in Tageseinrichtungen"}]
[null,null,{"$f":"B3_UE","v":"Indikator B3: Betreute Kinder bis unter 3 Jahren und von 3 bis unter 6 Jahren mit Zuwanderungsgeschichte in Kindertagesbetreuung"}]
[null,null,{"$f":"B5a_UE","v":"Indikator B5: Schulabgängerinnen und Schulabgänger ohne Hauptschulabschluss nach Nationalität "}]
[]
[null,null,"C | Erwerbstätigkeit und Arbeitsmarkt"]
[]
[null,null,{"$f":"'C4'!C6","v":"Indikator C4: Sozialversicherungspflichtig beschäftigte Ausländerinnen und Ausländer nach Art der Ausbildung"}]
[]
[null,null,"D | Soziales"]
[]
[null,null,{"$f":"D2_UE","v":"Indikator D2: Empfängerinnen und Empfänger von Mindestsicherungsleistungen"}]
[null,null,{"$f":"D3_UE","v":"Indikator D3: Empfängerinnen und Empfänger von Mindestsicherungsleistungen nach Altersgruppen"}]

{"sheet":"Methodische Vorbemerkungen","index":5,"n_rows":58,"n_cols":2,"rows_kept":58,"merged":[[6,4,6,9],[7,4,7,9],[33,2,33,9]]}
[null,{"$f":"Kopf","v":"Migration und Teilhabe in Niedersachsen - Integrationsmonitoring 2020 - Regionalinformationen "}]
{"$rows_empty":50}
[null,"Weiterführende Links"]
[null,"LSN Online Datenbank"]
[null,"Regionaldatenbank Deutschland"]
[null,"Statistische Berichte und Veröffentlichungen des LSN"]
[null,"Gemeinschaftsveröffentlichungen der Statistischen Ämter des Bundes und der Länder"]
[null,"Integrationsmonitoring der Länder"]
[null,"Integrationsmonitoring Niedersachsen 2020"]

{"sheet":"A1","index":6,"n_rows":120,"n_cols":22,"rows_kept":120,"merged":[[2,2,2,4],[7,2,9,2],[7,3,9,3],[7,4,7,18],[7,19,7,21],[9,4,9,18],[9,19,9,21],[72,3,73,15],[75,3,75,6]]}
[{"$nulls":3},{"$f":"Kopf","v":"Migration und Teilhabe in Niedersachsen - Integrationsmonitoring 2020 - Regionalinformationen "}]
[]
[]
[]
[{"$nulls":3},"Indikator A1: Bevölkerung in Niedersachsen "]
[{"$nulls":3},"Tabelle A1-2: Bevölkerung 2005 bis 2019 nach Kreisen"]
[]
[null,null,"AGS","Kreisfreie Stadt\nLandkreis\n(Großstadt, Umland)\nStatistische Region\nLand","Einwohnerinnen und Einwohner am 31.12.1)",{"$nulls":14},"Veränderung"]
[{"$nulls":4},2005,2006,2007,2008,2009,2010,2011,2012,2013,2014,2015,2016,2017,2018,2019,"2019 / 2005","2019 / 2014","2019 / 2018"]
[{"$nulls":4},"Anzahl",{"$nulls":14},"Prozent"]
[null,null,"Spalte1","1","2","3","4","5","6","7","8","9","10","11","12","13","14","  15","16","17","  18","  19"]
[null,null,101,{"$f":"VLOOKUP(Tabelle1[[#This Row],[Spalte1]],AGS_Namen!$C$1:$D$58,2,FALSE)","v":"Braunschweig, Stadt"},{"v":245273,"d":" 245 273"},{"v":245467,"d":" 245 467"},{"v":245810,"d":" 245 810"},{"v":246012,"d":" 246 012"},{"v":247400,"d":" 247 400"},{"v":248867,"d":" 248 867"},{"v":243829,"d":" 243 829"},{"v":245798,"d":" 245 798"},{"v":247227,"d":" 247 227"},{"v":248502,"d":" 248 502"},{"v":251364,"d":" 251 364"},{"v":248667,"d":" 248 667"},{"v":248023,"d":" 248 023"},{"v":248292,"d":" 248 292"},{"v":249406,"d":" 249 406"},{"v":1.6850611359587073,"d":"1.7"},{"v":0.36377976837208553,"d":"0.4"},{"v":0.4486652812011664,"d":"0.4"}]
[null,null,102,{"$f":"VLOOKUP(Tabelle1[[#This Row],[Spalte1]],AGS_Namen!$C$1:$D$58,2,FALSE)","v":"Salzgitter, Stadt"},{"v":107726,"d":" 107 726"},{"v":106665,"d":" 106 665"},{"v":105320,"d":" 105 320"},{"v":104423,"d":" 104 423"},{"v":103446,"d":" 103 446"},{"v":102394,"d":" 102 394"},{"v":98588,"d":" 98 588"},{"v":98095,"d":" 98 095"},{"v":98197,"d":" 98 197"},{"v":98966,"d":" 98 966"},{"v":101079,"d":" 101 079"},{"v":103668,"d":" 103 668"},{"v":104548,"d":" 104 548"},{"v":104948,"d":" 104 948"},{"v":104291,"d":" 104 291"},{"v":-3.188645266695134,"d":"-3.2"},{"v":5.380635773902148,"d":"5.4"},{"v":-0.6260243168045128,"d":"-0.6"}]
[null,null,103,{"$f":"VLOOKUP(Tabelle1[[#This Row],[Spalte1]],AGS_Namen!$C$1:$D$58,2,FALSE)","v":"Wolfsburg, Stadt"},{"v":121199,"d":" 121 199"},{"v":120493,"d":" 120 493"},{"v":120009,"d":" 120 009"},{"v":120538,"d":" 120 538"},{"v":121109,"d":" 121 109"},{"v":121451,"d":" 121 451"},{"v":120889,"d":" 120 889"},{"v":121758,"d":" 121 758"},{"v":122457,"d":" 122 457"},{"v":123027,"d":" 123 027"},{"v":124045,"d":" 124 045"},{"v":123909,"d":" 123 909"},{"v":123914,"d":" 123 914"},{"v":124151,"d":" 124 151"},{"v":124371,"d":" 124 371"},{"v":2.6171833100933175,"d":"2.6"},{"v":1.0924431222414592,"d":"1.1"},{"v":0.1772035666245137,"d":"0.2"}]
[null,null,151,{"$f":"VLOOKUP(Tabelle1[[#This Row],[Spalte1]],AGS_Namen!$C$1:$D$58,2,FALSE)","v":"Gifhorn"},{"v":175298,"d":" 175 298"},{"v":174974,"d":" 174 974"},{"v":174401,"d":" 174 401"},{"v":173765,"d":" 173 765"},{"v":173223,"d":" 173 223"},{"v":172643,"d":" 172 643"},{"v":170865,"d":" 170 865"},{"v":171015,"d":" 171 015"},{"v":171475,"d":" 171 475"},{"v":172541,"d":" 172 541"},{"v":174205,"d":" 174 205"},{"v":174749,"d":" 174 749"},{"v":175079,"d":" 175 079"},{"v":175920,"d":" 175 920"},{"v":176523,"d":" 176 523"},{"v":0.698810026355121,"d":"0.7"},{"v":2.307857262911424,"d":"2.3"},{"v":0.3427694406548431,"d":"0.3"}]
[null,null,153,{"$f":"VLOOKUP(Tabelle1[[#This Row],[Spalte1]],AGS_Namen!$C$1:$D$58,2,FALSE)","v":"Goslar"},{"v":151452,"d":" 151 452"},{"v":149656,"d":" 149 656"},{"v":148091,"d":" 148 091"},{"v":146187,"d":" 146 187"},{"v":144680,"d":" 144 680"},{"v":143014,"d":" 143 014"},{"v":139575,"d":" 139 575"},{"v":138655,"d":" 138 655"},{"v":137833,"d":" 137 833"},{"v":137256,"d":" 137 256"},{"v":138236,"d":" 138 236"},{"v":137979,"d":" 137 979"},{"v":137563,"d":" 137 563"},{"v":137014,"d":" 137 014"},{"v":136292,"d":" 136 292"},{"v":-10.009772073000027,"d":"-10.0"},{"v":-0.7023372384449496,"d":"-0.7"},{"v":-0.5269534500124075,"d":"-0.5"}]
[null,null,154,{"$f":"VLOOKUP(Tabelle1[[#This Row],[Spalte1]],AGS_Namen!$C$1:$D$58,2,FALSE)","v":"Helmstedt"},{"v":97749,"d":" 97 749"},{"v":96972,"d":" 96 972"},{"v":95871,"d":" 95 871"},{"v":94870,"d":" 94 870"},{"v":93903,"d":" 93 903"},{"v":92836,"d":" 92 836"},{"v":90919,"d":" 90 919"},{"v":90391,"d":" 90 391"},{"v":90423,"d":" 90 423"},{"v":90908,"d":" 90 908"},{"v":91500,"d":" 91 500"},{"v":92079,"d":" 92 079"},{"v":91720,"d":" 91 720"},{"v":91307,"d":" 91 307"},{"v":91297,"d":" 91 297"},{"v":-6.600579034056614,"d":"-6.6"},{"v":0.42790513486161835,"d":"0.4"},{"v":-0.010952062821032341,"d":"-0.0"}]
[null,null,155,{"$f":"VLOOKUP(Tabelle1[[#This Row],[Spalte1]],AGS_Namen!$C$1:$D$58,2,FALSE)","v":"Northeim"},{"v":146690,"d":" 146 690"},{"v":145488,"d":" 145 488"},{"v":144044,"d":" 144 044"},{"v":142321,"d":" 142 321"},{"v":140553,"d":" 140 553"},{"v":139060,"d":" 139 060"},{"v":136516,"d":" 136 516"},{"v":135418,"d":" 135 418"},{"v":134661,"d":" 134 661"},{"v":133905,"d":" 133 905"},{"v":134896,"d":" 134 896"},{"v":133610,"d":" 133 610"},{"v":133046,"d":" 133 046"},{"v":132765,"d":" 132 765"},{"v":132285,"d":" 132 285"},{"v":-9.820028631808576,"d":"-9.8"},{"v":-1.2098129270751652,"d":"-1.2"},{"v":-0.3615410688057847,"d":"-0.4"}]
[null,null,157,{"$f":"VLOOKUP(Tabelle1[[#This Row],[Spalte1]],AGS_Namen!$C$1:$D$58,2,FALSE)","v":"Peine"},{"v":134581,"d":" 134 581"},{"v":134178,"d":" 134 178"},{"v":133560,"d":" 133 560"},{"v":132613,"d":" 132 613"},{"v":132066,"d":" 132 066"},{"v":131481,"d":" 131 481"},{"v":130165,"d":" 130 165"},{"v":130047,"d":" 130 047"},{"v":130147,"d":" 130 147"},{"v":130601,"d":" 130 601"},{"v":132320,"d":" 132 320"},{"v":132979,"d":" 132 979"},{"v":133368,"d":" 133 368"},{"v":133965,"d":" 133 965"},{"v":134801,"d":" 134 801"},{"v":0.16347032642051998,"d":"0.2"},{"v":3.215901869051539,"d":"3.2"},{"v":0.6240435934759079,"d":"0.6"}]
[null,null,158,{"$f":"VLOOKUP(Tabelle1[[#This Row],[Spalte1]],AGS_Namen!$C$1:$D$58,2,FALSE)","v":"Wolfenbüttel"},{"v":126460,"d":" 126 460"},{"v":125412,"d":" 125 412"},{"v":124652,"d":" 124 652"},{"v":123663,"d":" 123 663"},{"v":122806,"d":" 122 806"},{"v":122040,"d":" 122 040"},{"v":120425,"d":" 120 425"},{"v":120117,"d":" 120 117"},{"v":119900,"d":" 119 900"},{"v":120035,"d":" 120 035"},{"v":120981,"d":" 120 981"},{"v":120904,"d":" 120 904"},{"v":120437,"d":" 120 437"},{"v":119960,"d":" 119 960"},{"v":119622,"d":" 119 622"},{"v":-5.407243397121619,"d":"-5.4"},{"v":-0.3440663139917524,"d":"-0.3"},{"v":-0.28176058686228744,"d":"-0.3"}]
[null,null,159,{"$f":"VLOOKUP(Tabelle1[[#This Row],[Spalte1]],AGS_Namen!$C$1:$D$58,2,FALSE)","v":"Göttingen"},{"v":344905,"d":" 344 905"},{"v":342767,"d":" 342 767"},{"v":341759,"d":" 341 759"},{"v":339828,"d":" 339 828"},{"v":338162,"d":" 338 162"},{"v":336372,"d":" 336 372"},{"v":324550,"d":" 324 550"},{"v":323311,"d":" 323 311"},{"v":322427,"d":" 322 427"},{"v":322509,"d":" 322 509"},{"v":325261,"d":" 325 261"},{"v":326244,"d":" 326 244"},{"v":327395,"d":" 327 395"},{"v":328074,"d":" 328 074"},{"v":326041,"d":" 326 041"},{"v":-5.469332134935707,"d":"-5.5"},{"v":1.095163235754661,"d":"1.1"},{"v":-0.44792798954529356,"d":"-0.4"}]
[null,null,159016,{"$f":"VLOOKUP(Tabelle1[[#This Row],[Spalte1]],AGS_Namen!$C$1:$D$58,2,FALSE)","v":"   dav. Göttingen, Stadt"},{"v":121865,"d":" 121 865"},{"v":121531,"d":" 121 531"},{"v":121242,"d":" 121 242"},{"v":121112,"d":" 121 112"},{"v":121056,"d":" 121 056"},{"v":121280,"d":" 121 280"},{"v":115707,"d":" 115 707"},{"v":116111,"d":" 116 111"},{"v":116420,"d":" 116 420"},{"v":116599,"d":" 116 599"},{"v":117406,"d":" 117 406"},{"v":118571,"d":" 118 571"},{"v":118956,"d":" 118 956"},{"v":119801,"d":" 119 801"},{"v":118911,"d":" 118 911"},{"v":-2.423993763590859,"d":"-2.4"},{"v":1.9828643470355662,"d":"2.0"},{"v":-0.3536322727158456,"d":"-0.4"}]
[null,null,159999,{"$f":"VLOOKUP(Tabelle1[[#This Row],[Spalte1]],AGS_Namen!$C$1:$D$58,2,FALSE)","v":"   dav. Göttingen, Umland"},{"v":223040,"d":" 223 040"},{"v":221236,"d":" 221 236"},{"v":220517,"d":" 220 517"},{"v":218716,"d":" 218 716"},{"v":217106,"d":" 217 106"},{"v":215092,"d":" 215 092"},{"v":208843,"d":" 208 843"},{"v":207200,"d":" 207 200"},{"v":206007,"d":" 206 007"},{"v":205910,"d":" 205 910"},{"v":207855,"d":" 207 855"},{"v":207673,"d":" 207 673"},{"v":208439,"d":" 208 439"},{"v":208273,"d":" 208 273"},{"v":207130,"d":" 207 130"},{"v":-7.133249641319942,"d":"-7.1"},{"v":0.5924918653780779,"d":"0.6"},{"v":-0.5019815059445178,"d":"-0.5"}]
[null,null,1,{"$f":"VLOOKUP(Tabelle1[[#This Row],[Spalte1]],AGS_Namen!$C$1:$D$58,2,FALSE)","v":"Stat. Region Braunschweig"},{"v":1650435,"d":"1 650 435"},{"v":1641776,"d":"1 641 776"},{"v":1633318,"d":"1 633 318"},{"v":1623649,"d":"1 623 649"},{"v":1616720,"d":"1 616 720"},{"v":1609369,"d":"1 609 369"},{"v":1575968,"d":"1 575 968"},{"v":1574527,"d":"1 574 527"},{"v":1574936,"d":"1 574 936"},{"v":1579754,"d":"1 579 754"},{"v":1598164,"d":"1 598 164"},{"v":1595609,"d":"1 595 609"},{"v":1595734,"d":"1 595 734"},{"v":1596396,"d":"1 596 396"},{"v":1594929,"d":"1 594 929"},{"v":-3.363113361023003,"d":"-3.4"},{"v":0.9605925985944647,"d":"1.0"},{"v":-0.09189449234400487,"d":"-0.1"}]
[null,null,241,{"$f":"VLOOKUP(Tabelle1[[#This Row],[Spalte1]],AGS_Namen!$C$1:$D$58,2,FALSE)","v":"Hannover, Region"},{"v":1128543,"d":"1 128 543"},{"v":1128772,"d":"1 128 772"},{"v":1130039,"d":"1 130 039"},{"v":1129797,"d":"1 129 797"},{"v":1130262,"d":"1 130 262"},{"v":1132130,"d":"1 132 130"},{"v":1106219,"d":"1 106 219"},{"v":1112675,"d":"1 112 675"},{"v":1119526,"d":"1 119 526"},{"v":1128037,"d":"1 128 037"},{"v":1144481,"d":"1 144 481"},{"v":1148700,"d":"1 148 700"},{"v":1152675,"d":"1 152 675"},{"v":1157624,"d":"1 157 624"},{"v":1157115,"d":"1 157 115"},{"v":2.5317599772449966,"d":"2.5"},{"v":2.5777523254999615,"d":"2.6"},{"v":-0.04396937174764863,"d":"-0.0"}]
[null,null,241001,{"$f":"VLOOKUP(Tabelle1[[#This Row],[Spalte1]],AGS_Namen!$C$1:$D$58,2,FALSE)","v":"   dav. Hannover, Lhst."},{"v":515729,"d":" 515 729"},{"v":516343,"d":" 516 343"},{"v":518069,"d":" 518 069"},{"v":519619,"d":" 519 619"},{"v":520966,"d":" 520 966"},{"v":522686,"d":" 522 686"},{"v":509485,"d":" 509 485"},{"v":514137,"d":" 514 137"},{"v":518386,"d":" 518 386"},{"v":523642,"d":" 523 642"},{"v":532163,"d":" 532 163"},{"v":532864,"d":" 532 864"},{"v":535061,"d":" 535 061"},{"v":538068,"d":" 538 068"},{"v":536925,"d":" 536 925"},{"v":4.109910437458432,"d":"4.1"},{"v":2.536656723486657,"d":"2.5"},{"v":-0.21242668212939628,"d":"-0.2"}]
[null,null,241999,{"$f":"VLOOKUP(Tabelle1[[#This Row],[Spalte1]],AGS_Namen!$C$1:$D$58,2,FALSE)","v":"   dav. Hannover, Umland"},{"v":612814,"d":" 612 814"},{"v":612429,"d":" 612 429"},{"v":611970,"d":" 611 970"},{"v":610178,"d":" 610 178"},{"v":609296,"d":" 609 296"},{"v":609444,"d":" 609 444"},{"v":596734,"d":" 596 734"},{"v":598538,"d":" 598 538"},{"v":601140,"d":" 601 140"},{"v":604395,"d":" 604 395"},{"v":612318,"d":" 612 318"},{"v":615836,"d":" 615 836"},{"v":617614,"d":" 617 614"},{"v":619556,"d":" 619 556"},{"v":620190,"d":" 620 190"},{"v":1.2036278544550223,"d":"1.2"},{"v":2.6133571588117044,"d":"2.6"},{"v":0.10233134696460046,"d":"0.1"}]
[null,null,251,{"$f":"VLOOKUP(Tabelle1[[#This Row],[Spalte1]],AGS_Namen!$C$1:$D$58,2,FALSE)","v":"Diepholz"},{"v":215548,"d":" 215 548"},{"v":215406,"d":" 215 406"},{"v":215142,"d":" 215 142"},{"v":214379,"d":" 214 379"},{"v":213634,"d":" 213 634"},{"v":213558,"d":" 213 558"},{"v":209745,"d":" 209 745"},{"v":209671,"d":" 209 671"},{"v":209955,"d":" 209 955"},{"v":211093,"d":" 211 093"},{"v":213976,"d":" 213 976"},{"v":215082,"d":" 215 082"},{"v":216012,"d":" 216 012"},{"v":216886,"d":" 216 886"},{"v":217089,"d":" 217 089"},{"v":0.7149219663369644,"d":"0.7"},{"v":2.8404542073872654,"d":"2.8"},{"v":0.09359755816419686,"d":"0.1"}]
[null,null,252,{"$f":"VLOOKUP(Tabelle1[[#This Row],[Spalte1]],AGS_Namen!$C$1:$D$58,2,FALSE)","v":"Hameln-Pyrmont"},{"v":159840,"d":" 159 840"},{"v":158658,"d":" 158 658"},{"v":157867,"d":" 157 867"},{"v":156398,"d":" 156 398"},{"v":155164,"d":" 155 164"},{"v":154085,"d":" 154 085"},{"v":149513,"d":" 149 513"},{"v":148532,"d":" 148 532"},{"v":147755,"d":" 147 755"},{"v":147813,"d":" 147 813"},{"v":148281,"d":" 148 281"},{"v":148265,"d":" 148 265"},{"v":148296,"d":" 148 296"},{"v":148559,"d":" 148 559"},{"v":148549,"d":" 148 549"},{"v":-7.063938938938939,"d":"-7.1"},{"v":0.49792643407548726,"d":"0.5"},{"v":-6.731332332608593E-3,"d":"-0.0"}]
[null,null,254,{"$f":"VLOOKUP(Tabelle1[[#This Row],[Spalte1]],AGS_Namen!$C$1:$D$58,2,FALSE)","v":"Hildesheim"},{"v":290643,"d":" 290 643"},{"v":289984,"d":" 289 984"},{"v":288623,"d":" 288 623"},{"v":286663,"d":" 286 663"},{"v":284551,"d":" 284 551"},{"v":282856,"d":" 282 856"},{"v":276383,"d":" 276 383"},{"v":275330,"d":" 275 330"},{"v":274519,"d":" 274 519"},{"v":274554,"d":" 274 554"},{"v":277055,"d":" 277 055"},{"v":277300,"d":" 277 300"},{"v":276640,"d":" 276 640"},{"v":276594,"d":" 276 594"},{"v":275817,"d":" 275 817"},{"v":-5.101103415530393,"d":"-5.1"},{"v":0.4600187941170043,"d":"0.5"},{"v":-0.2809171565543721,"d":"-0.3"}]
[null,null,254021,{"$f":"VLOOKUP(Tabelle1[[#This Row],[Spalte1]],AGS_Namen!$C$1:$D$58,2,FALSE)","v":"Hildesheim, Stadt"},{"v":102575,"d":" 102 575"},{"v":103249,"d":" 103 249"},{"v":103593,"d":" 103 593"},{"v":103288,"d":" 103 288"},{"v":102903,"d":" 102 903"},{"v":102794,"d":" 102 794"},{"v":99041,"d":" 99 041"},{"v":99224,"d":" 99 224"},{"v":99390,"d":" 99 390"},{"v":99979,"d":" 99 979"},{"v":101667,"d":" 101 667"},{"v":101687,"d":" 101 687"},{"v":101744,"d":" 101 744"},{"v":101990,"d":" 101 990"},{"v":101693,"d":" 101 693"},{"v":-0.859858640019498,"d":"-0.9"},{"v":1.7143600156032768,"d":"1.7"},{"v":-0.2912050201000098,"d":"-0.3"}]
[null,null,254999,{"$f":"VLOOKUP(Tabelle1[[#This Row],[Spalte1]],AGS_Namen!$C$1:$D$58,2,FALSE)","v":"Hildesheim, Umland"},{"v":188068,"d":" 188 068"},{"v":186735,"d":" 186 735"},{"v":185030,"d":" 185 030"},{"v":183375,"d":" 183 375"},{"v":181648,"d":" 181 648"},{"v":180062,"d":" 180 062"},{"v":177342,"d":" 177 342"},{"v":176106,"d":" 176 106"},{"v":175129,"d":" 175 129"},{"v":174575,"d":" 174 575"},{"v":175388,"d":" 175 388"},{"v":175613,"d":" 175 613"},{"v":174896,"d":" 174 896"},{"v":174604,"d":" 174 604"},{"v":174124,"d":" 174 124"},{"v":-7.4143394942254925,"d":"-7.4"},{"v":-0.2583416869540312,"d":"-0.3"},{"v":-0.2749077913449864,"d":"-0.3"}]
[null,null,255,{"$f":"VLOOKUP(Tabelle1[[#This Row],[Spalte1]],AGS_Namen!$C$1:$D$58,2,FALSE)","v":"Holzminden"},{"v":77918,"d":" 77 918"},{"v":76888,"d":" 76 888"},{"v":76103,"d":" 76 103"},{"v":75092,"d":" 75 092"},{"v":74094,"d":" 74 094"},{"v":73240,"d":" 73 240"},{"v":73155,"d":" 73 155"},{"v":72459,"d":" 72 459"},{"v":71877,"d":" 71 877"},{"v":71438,"d":" 71 438"},{"v":71659,"d":" 71 659"},{"v":71510,"d":" 71 510"},{"v":71144,"d":" 71 144"},{"v":70975,"d":" 70 975"},{"v":70458,"d":" 70 458"},{"v":-9.574167714777074,"d":"-9.6"},{"v":-1.3718189199025728,"d":"-1.4"},{"v":-0.7284255019373018,"d":"-0.7"}]
[null,null,256,{"$f":"VLOOKUP(Tabelle1[[#This Row],[Spalte1]],AGS_Namen!$C$1:$D$58,2,FALSE)","v":"Nienburg (Weser)"},{"v":125870,"d":" 125 870"},{"v":125436,"d":" 125 436"},{"v":124895,"d":" 124 895"},{"v":123881,"d":" 123 881"},{"v":122989,"d":" 122 989"},{"v":122206,"d":" 122 206"},{"v":121390,"d":" 121 390"},{"v":120225,"d":" 120 225"},{"v":119848,"d":" 119 848"},{"v":119631,"d":" 119 631"},{"v":120632,"d":" 120 632"},{"v":121503,"d":" 121 503"},{"v":121470,"d":" 121 470"},{"v":121386,"d":" 121 386"},{"v":121390,"d":" 121 390"},{"v":-3.5592277746881704,"d":"-3.6"},{"v":1.4703546739557471,"d":"1.5"},{"v":3.2952729309805085E-3,"d":"0.0"}]
[null,null,257,{"$f":"VLOOKUP(Tabelle1[[#This Row],[Spalte1]],AGS_Namen!$C$1:$D$58,2,FALSE)","v":"Schaumburg"},{"v":165557,"d":" 165 557"},{"v":165109,"d":" 165 109"},{"v":164172,"d":" 164 172"},{"v":162971,"d":" 162 971"},{"v":161746,"d":" 161 746"},{"v":160636,"d":" 160 636"},{"v":157026,"d":" 157 026"},{"v":156039,"d":" 156 039"},{"v":155599,"d":" 155 599"},{"v":155847,"d":" 155 847"},{"v":156206,"d":" 156 206"},{"v":157616,"d":" 157 616"},{"v":157883,"d":" 157 883"},{"v":157781,"d":" 157 781"},{"v":157820,"d":" 157 820"},{"v":-4.673314930809329,"d":"-4.7"},{"v":1.2659852291029021,"d":"1.3"},{"v":0.024717805058910768,"d":"0.0"}]
[null,null,2,{"$f":"VLOOKUP(Tabelle1[[#This Row],[Spalte1]],AGS_Namen!$C$1:$D$58,2,FALSE)","v":"Stat. Region Hannover"},{"v":2163919,"d":"2 163 919"},{"v":2160253,"d":"2 160 253"},{"v":2156841,"d":"2 156 841"},{"v":2149181,"d":"2 149 181"},{"v":2142440,"d":"2 142 440"},{"v":2138711,"d":"2 138 711"},{"v":2093431,"d":"2 093 431"},{"v":2094931,"d":"2 094 931"},{"v":2099079,"d":"2 099 079"},{"v":2108413,"d":"2 108 413"},{"v":2132290,"d":"2 132 290"},{"v":2139976,"d":"2 139 976"},{"v":2144120,"d":"2 144 120"},{"v":2149805,"d":"2 149 805"},{"v":2148238,"d":"2 148 238"},{"v":-0.7246574386564377,"d":"-0.7"},{"v":1.8888614327458615,"d":"1.9"},{"v":-0.07289033191382474,"d":"-0.1"}]
[null,null,351,{"$f":"VLOOKUP(Tabelle1[[#This Row],[Spalte1]],AGS_Namen!$C$1:$D$58,2,FALSE)","v":"Celle"},{"v":182444,"d":" 182 444"},{"v":181936,"d":" 181 936"},{"v":181115,"d":" 181 115"},{"v":180130,"d":" 180 130"},{"v":179247,"d":" 179 247"},{"v":178528,"d":" 178 528"},{"v":176054,"d":" 176 054"},{"v":175706,"d":" 175 706"},{"v":175552,"d":" 175 552"},{"v":176157,"d":" 176 157"},{"v":177971,"d":" 177 971"},{"v":178370,"d":" 178 370"},{"v":178764,"d":" 178 764"},{"v":178936,"d":" 178 936"},{"v":179011,"d":" 179 011"},{"v":-1.8816732805682839,"d":"-1.9"},{"v":1.6201456655142856,"d":"1.6"},{"v":0.04191442750480619,"d":"0.0"}]
[null,null,352,{"$f":"VLOOKUP(Tabelle1[[#This Row],[Spalte1]],AGS_Namen!$C$1:$D$58,2,FALSE)","v":"Cuxhaven"},{"v":205276,"d":" 205 276"},{"v":204235,"d":" 204 235"},{"v":202933,"d":" 202 933"},{"v":202124,"d":" 202 124"},{"v":201188,"d":" 201 188"},{"v":200464,"d":" 200 464"},{"v":198115,"d":" 198 115"},{"v":197433,"d":" 197 433"},{"v":196607,"d":" 196 607"},{"v":196787,"d":" 196 787"},{"v":198103,"d":" 198 103"},{"v":198670,"d":" 198 670"},{"v":198100,"d":" 198 100"},{"v":198213,"d":" 198 213"},{"v":198038,"d":" 198 038"},{"v":-3.5259845281474695,"d":"-3.5"},{"v":0.6357127249259351,"d":"0.6"},{"v":-0.0882888609727919,"d":"-0.1"}]
[null,null,353,{"$f":"VLOOKUP(Tabelle1[[#This Row],[Spalte1]],AGS_Namen!$C$1:$D$58,2,FALSE)","v":"Harburg"},{"v":241827,"d":" 241 827"},{"v":242748,"d":" 242 748"},{"v":243888,"d":" 243 888"},{"v":244640,"d":" 244 640"},{"v":245624,"d":" 245 624"},{"v":246868,"d":" 246 868"},{"v":239269,"d":" 239 269"},{"v":240548,"d":" 240 548"},{"v":242871,"d":" 242 871"},{"v":245199,"d":" 245 199"},{"v":248122,"d":" 248 122"},{"v":250326,"d":" 250 326"},{"v":251511,"d":" 251 511"},{"v":252776,"d":" 252 776"},{"v":254431,"d":" 254 431"},{"v":5.21199038982413,"d":"5.2"},{"v":3.7651050779163047,"d":"3.8"},{"v":0.6547298794189321,"d":"0.7"}]
[null,null,354,{"$f":"VLOOKUP(Tabelle1[[#This Row],[Spalte1]],AGS_Namen!$C$1:$D$58,2,FALSE)","v":"Lüchow-Dannenberg"},{"v":51352,"d":" 51 352"},{"v":50878,"d":" 50 878"},{"v":50465,"d":" 50 465"},{"v":49965,"d":" 49 965"},{"v":49699,"d":" 49 699"},{"v":49213,"d":" 49 213"},{"v":49082,"d":" 49 082"},{"v":48928,"d":" 48 928"},{"v":48670,"d":" 48 670"},{"v":48728,"d":" 48 728"},{"v":50128,"d":" 50 128"},{"v":48825,"d":" 48 825"},{"v":48357,"d":" 48 357"},{"v":48424,"d":" 48 424"},{"v":48412,"d":" 48 412"},{"v":-5.7251908396946565,"d":"-5.7"},{"v":-0.64849778361517,"d":"-0.6"},{"v":-0.02478110028085247,"d":"-0.0"}]
[null,null,355,{"$f":"VLOOKUP(Tabelle1[[#This Row],[Spalte1]],AGS_Namen!$C$1:$D$58,2,FALSE)","v":"Lüneburg"},{"v":175441,"d":" 175 441"},{"v":175906,"d":" 175 906"},{"v":176445,"d":" 176 445"},{"v":176512,"d":" 176 512"},{"v":177042,"d":" 177 042"},{"v":177279,"d":" 177 279"},{"v":174685,"d":" 174 685"},{"v":175640,"d":" 175 640"},{"v":176727,"d":" 176 727"},{"v":178122,"d":" 178 122"},{"v":180719,"d":" 180 719"},{"v":181605,"d":" 181 605"},{"v":182930,"d":" 182 930"},{"v":183372,"d":" 183 372"},{"v":184139,"d":" 184 139"},{"v":4.957792078248528,"d":"5.0"},{"v":3.3780218052795274,"d":"3.4"},{"v":0.41827541827541825,"d":"0.4"}]
[null,null,356,{"$f":"VLOOKUP(Tabelle1[[#This Row],[Spalte1]],AGS_Namen!$C$1:$D$58,2,FALSE)","v":"Osterholz"},{"v":112741,"d":" 112 741"},{"v":112498,"d":" 112 498"},{"v":112679,"d":" 112 679"},{"v":112486,"d":" 112 486"},{"v":112029,"d":" 112 029"},{"v":111876,"d":" 111 876"},{"v":110842,"d":" 110 842"},{"v":110816,"d":" 110 816"},{"v":110882,"d":" 110 882"},{"v":111484,"d":" 111 484"},{"v":113579,"d":" 113 579"},{"v":112695,"d":" 112 695"},{"v":113105,"d":" 113 105"},{"v":113517,"d":" 113 517"},{"v":113928,"d":" 113 928"},{"v":1.0528556603187837,"d":"1.1"},{"v":2.1922428330522767,"d":"2.2"},{"v":0.3620603081476783,"d":"0.4"}]
[null,null,357,{"$f":"VLOOKUP(Tabelle1[[#This Row],[Spalte1]],AGS_Namen!$C$1:$D$58,2,FALSE)","v":"Rotenburg (Wümme)"},{"v":164875,"d":" 164 875"},{"v":164958,"d":" 164 958"},{"v":165074,"d":" 165 074"},{"v":164603,"d":" 164 603"},{"v":164064,"d":" 164 064"},{"v":163860,"d":" 163 860"},{"v":162182,"d":" 162 182"},{"v":161780,"d":" 161 780"},{"v":161308,"d":" 161 308"},{"v":161842,"d":" 161 842"},{"v":163253,"d":" 163 253"},{"v":163372,"d":" 163 372"},{"v":163377,"d":" 163 377"},{"v":163455,"d":" 163 455"},{"v":163782,"d":" 163 782"},{"v":-0.6629264594389689,"d":"-0.7"},{"v":1.1986999666341247,"d":"1.2"},{"v":0.20005506102597045,"d":"0.2"}]
[null,null,358,{"$f":"VLOOKUP(Tabelle1[[#This Row],[Spalte1]],AGS_Namen!$C$1:$D$58,2,FALSE)","v":"Heidekreis"},{"v":142678,"d":" 142 678"},{"v":142234,"d":" 142 234"},{"v":141692,"d":" 141 692"},{"v":140792,"d":" 140 792"},{"v":140053,"d":" 140 053"},{"v":139630,"d":" 139 630"},{"v":136072,"d":" 136 072"},{"v":135772,"d":" 135 772"},{"v":136251,"d":" 136 251"},{"v":136200,"d":" 136 200"},{"v":140264,"d":" 140 264"},{"v":139641,"d":" 139 641"},{"v":139099,"d":" 139 099"},{"v":139755,"d":" 139 755"},{"v":140673,"d":" 140 673"},{"v":-1.4052621987972918,"d":"-1.4"},{"v":3.2841409691629955,"d":"3.3"},{"v":0.6568637973596652,"d":"0.7"}]
[null,null,359,{"$f":"VLOOKUP(Tabelle1[[#This Row],[Spalte1]],AGS_Namen!$C$1:$D$58,2,FALSE)","v":"Stade"},{"v":196475,"d":" 196 475"},{"v":197122,"d":" 197 122"},{"v":197091,"d":" 197 091"},{"v":196891,"d":" 196 891"},{"v":196952,"d":" 196 952"},{"v":197132,"d":" 197 132"},{"v":195606,"d":" 195 606"},{"v":195779,"d":" 195 779"},{"v":196516,"d":" 196 516"},{"v":197448,"d":" 197 448"},{"v":200054,"d":" 200 054"},{"v":201638,"d":" 201 638"},{"v":201887,"d":" 201 887"},{"v":203102,"d":" 203 102"},{"v":204512,"d":" 204 512"},{"v":4.0905967680366455,"d":"4.1"},{"v":3.5776508245208865,"d":"3.6"},{"v":0.6942324546287088,"d":"0.7"}]
[null,null,360,{"$f":"VLOOKUP(Tabelle1[[#This Row],[Spalte1]],AGS_Namen!$C$1:$D$58,2,FALSE)","v":"Uelzen"},{"v":96940,"d":" 96 940"},{"v":96458,"d":" 96 458"},{"v":95983,"d":" 95 983"},{"v":94940,"d":" 94 940"},{"v":94428,"d":" 94 428"},{"v":94020,"d":" 94 020"},{"v":93284,"d":" 93 284"},{"v":92801,"d":" 92 801"},{"v":92356,"d":" 92 356"},{"v":92533,"d":" 92 533"},{"v":93131,"d":" 93 131"},{"v":92961,"d":" 92 961"},{"v":92744,"d":" 92 744"},{"v":92572,"d":" 92 572"},{"v":92389,"d":" 92 389"},{"v":-4.694656488549619,"d":"-4.7"},{"v":-0.15562015713313088,"d":"-0.2"},{"v":-0.19768396491379683,"d":"-0.2"}]
[null,null,361,{"$f":"VLOOKUP(Tabelle1[[#This Row],[Spalte1]],AGS_Namen!$C$1:$D$58,2,FALSE)","v":"Verden"},{"v":134084,"d":" 134 084"},{"v":133965,"d":" 133 965"},{"v":133767,"d":" 133 767"},{"v":133560,"d":" 133 560"},{"v":133328,"d":" 133 328"},{"v":133368,"d":" 133 368"},{"v":131936,"d":" 131 936"},{"v":132129,"d":" 132 129"},{"v":132459,"d":" 132 459"},{"v":133215,"d":" 133 215"},{"v":134645,"d":" 134 645"},{"v":135842,"d":" 135 842"},{"v":136590,"d":" 136 590"},{"v":136792,"d":" 136 792"},{"v":137133,"d":" 137 133"},{"v":2.273947674592047,"d":"2.3"},{"v":2.9411102353338587,"d":"2.9"},{"v":0.24928358383531202,"d":"0.2"}]
[null,null,3,{"$f":"VLOOKUP(Tabelle1[[#This Row],[Spalte1]],AGS_Namen!$C$1:$D$58,2,FALSE)","v":"Stat. Region Lüneburg"},{"v":1704133,"d":"1 704 133"},{"v":1702938,"d":"1 702 938"},{"v":1701132,"d":"1 701 132"},{"v":1696643,"d":"1 696 643"},{"v":1693654,"d":"1 693 654"},{"v":1692238,"d":"1 692 238"},{"v":1667127,"d":"1 667 127"},{"v":1667332,"d":"1 667 332"},{"v":1670199,"d":"1 670 199"},{"v":1677715,"d":"1 677 715"},{"v":1699969,"d":"1 699 969"},{"v":1703945,"d":"1 703 945"},{"v":1706464,"d":"1 706 464"},{"v":1710914,"d":"1 710 914"},{"v":1716448,"d":"1 716 448"},{"v":0.7226548632060995,"d":"0.7"},{"v":2.308675788200022,"d":"2.3"},{"v":0.32345284450299666,"d":"0.3"}]
[null,null,401,{"$f":"VLOOKUP(Tabelle1[[#This Row],[Spalte1]],AGS_Namen!$C$1:$D$58,2,FALSE)","v":"Delmenhorst, Stadt"},{"v":75916,"d":" 75 916"},{"v":75320,"d":" 75 320"},{"v":75135,"d":" 75 135"},{"v":74751,"d":" 74 751"},{"v":74512,"d":" 74 512"},{"v":74361,"d":" 74 361"},{"v":73364,"d":" 73 364"},{"v":73588,"d":" 73 588"},{"v":74052,"d":" 74 052"},{"v":74804,"d":" 74 804"},{"v":76323,"d":" 76 323"},{"v":77045,"d":" 77 045"},{"v":77521,"d":" 77 521"},{"v":77607,"d":" 77 607"},{"v":77559,"d":" 77 559"},{"v":2.164234153538121,"d":"2.2"},{"v":3.682958130581252,"d":"3.7"},{"v":-0.061850090842320925,"d":"-0.1"}]
[null,null,402,{"$f":"VLOOKUP(Tabelle1[[#This Row],[Spalte1]],AGS_Namen!$C$1:$D$58,2,FALSE)","v":"Emden, Stadt"},{"v":51693,"d":" 51 693"},{"v":51742,"d":" 51 742"},{"v":51714,"d":" 51 714"},{"v":51562,"d":" 51 562"},{"v":51292,"d":" 51 292"},{"v":51616,"d":" 51 616"},{"v":49848,"d":" 49 848"},{"v":49751,"d":" 49 751"},{"v":49790,"d":" 49 790"},{"v":50016,"d":" 50 016"},{"v":50694,"d":" 50 694"},{"v":50486,"d":" 50 486"},{"v":50607,"d":" 50 607"},{"v":50195,"d":" 50 195"},{"v":49913,"d":" 49 913"},{"v":-3.443406263904204,"d":"-3.4"},{"v":-0.20593410108765195,"d":"-0.2"},{"v":-0.5618089451140552,"d":"-0.6"}]
[null,null,403,{"$f":"VLOOKUP(Tabelle1[[#This Row],[Spalte1]],AGS_Namen!$C$1:$D$58,2,FALSE)","v":"Oldenburg (Oldb), Stadt"},{"v":158565,"d":" 158 565"},{"v":159060,"d":" 159 060"},{"v":159563,"d":" 159 563"},{"v":160279,"d":" 160 279"},{"v":161334,"d":" 161 334"},{"v":162173,"d":" 162 173"},{"v":157706,"d":" 157 706"},{"v":158658,"d":" 158 658"},{"v":159610,"d":" 159 610"},{"v":160907,"d":" 160 907"},{"v":163830,"d":" 163 830"},{"v":165711,"d":" 165 711"},{"v":167081,"d":" 167 081"},{"v":168210,"d":" 168 210"},{"v":169077,"d":" 169 077"},{"v":6.629457950998013,"d":"6.6"},{"v":5.077467108329656,"d":"5.1"},{"v":0.5154271446406278,"d":"0.5"}]
[null,null,404,{"$f":"VLOOKUP(Tabelle1[[#This Row],[Spalte1]],AGS_Namen!$C$1:$D$58,2,FALSE)","v":"Osnabrück, Stadt"},{"v":163814,"d":" 163 814"},{"v":163020,"d":" 163 020"},{"v":162870,"d":" 162 870"},{"v":163286,"d":" 163 286"},{"v":163514,"d":" 163 514"},{"v":164119,"d":" 164 119"},{"v":154513,"d":" 154 513"},{"v":155625,"d":" 155 625"},{"v":156315,"d":" 156 315"},{"v":156897,"d":" 156 897"},{"v":162403,"d":" 162 403"},{"v":164070,"d":" 164 070"},{"v":164374,"d":" 164 374"},{"v":164748,"d":" 164 748"},{"v":165251,"d":" 165 251"},{"v":0.8772144016994885,"d":"0.9"},{"v":5.324512259635302,"d":"5.3"},{"v":0.305314783791002,"d":"0.3"}]
[null,null,405,{"$f":"VLOOKUP(Tabelle1[[#This Row],[Spalte1]],AGS_Namen!$C$1:$D$58,2,FALSE)","v":"Wilhelmshaven, Stadt"},{"v":83552,"d":" 83 552"},{"v":82797,"d":" 82 797"},{"v":82192,"d":" 82 192"},{"v":81411,"d":" 81 411"},{"v":81137,"d":" 81 137"},{"v":81324,"d":" 81 324"},{"v":76926,"d":" 76 926"},{"v":76545,"d":" 76 545"},{"v":75728,"d":" 75 728"},{"v":75534,"d":" 75 534"},{"v":75995,"d":" 75 995"},{"v":76201,"d":" 76 201"},{"v":76316,"d":" 76 316"},{"v":76278,"d":" 76 278"},{"v":76089,"d":" 76 089"},{"v":-8.932162006893911,"d":"-8.9"},{"v":0.7347684486456431,"d":"0.7"},{"v":-0.2477778651773775,"d":"-0.2"}]
[null,null,451,{"$f":"VLOOKUP(Tabelle1[[#This Row],[Spalte1]],AGS_Namen!$C$1:$D$58,2,FALSE)","v":"Ammerland"},{"v":115891,"d":" 115 891"},{"v":116626,"d":" 116 626"},{"v":117041,"d":" 117 041"},{"v":117102,"d":" 117 102"},{"v":117517,"d":" 117 517"},{"v":118004,"d":" 118 004"},{"v":117951,"d":" 117 951"},{"v":118489,"d":" 118 489"},{"v":118865,"d":" 118 865"},{"v":119917,"d":" 119 917"},{"v":121435,"d":" 121 435"},{"v":122698,"d":" 122 698"},{"v":123377,"d":" 123 377"},{"v":124071,"d":" 124 071"},{"v":124859,"d":" 124 859"},{"v":7.738305821849842,"d":"7.7"},{"v":4.121183818808009,"d":"4.1"},{"v":0.6351202134261834,"d":"0.6"}]
[null,null,452,{"$f":"VLOOKUP(Tabelle1[[#This Row],[Spalte1]],AGS_Namen!$C$1:$D$58,2,FALSE)","v":"Aurich"},{"v":190128,"d":" 190 128"},{"v":190252,"d":" 190 252"},{"v":190293,"d":" 190 293"},{"v":189381,"d":" 189 381"},{"v":188973,"d":" 188 973"},{"v":188947,"d":" 188 947"},{"v":186713,"d":" 186 713"},{"v":186673,"d":" 186 673"},{"v":187058,"d":" 187 058"},{"v":187998,"d":" 187 998"},{"v":189199,"d":" 189 199"},{"v":190066,"d":" 190 066"},{"v":189949,"d":" 189 949"},{"v":189848,"d":" 189 848"},{"v":189694,"d":" 189 694"},{"v":-0.22826727257426577,"d":"-0.2"},{"v":0.9021372567793274,"d":"0.9"},{"v":-0.0811175255994269,"d":"-0.1"}]
[null,null,453,{"$f":"VLOOKUP(Tabelle1[[#This Row],[Spalte1]],AGS_Namen!$C$1:$D$58,2,FALSE)","v":"Cloppenburg"},{"v":155642,"d":" 155 642"},{"v":156241,"d":" 156 241"},{"v":157164,"d":" 157 164"},{"v":157268,"d":" 157 268"},{"v":157506,"d":" 157 506"},{"v":158194,"d":" 158 194"},{"v":159290,"d":" 159 290"},{"v":160033,"d":" 160 033"},{"v":160176,"d":" 160 176"},{"v":162350,"d":" 162 350"},{"v":164734,"d":" 164 734"},{"v":165930,"d":" 165 930"},{"v":167925,"d":" 167 925"},{"v":169348,"d":" 169 348"},{"v":170682,"d":" 170 682"},{"v":9.663201449480217,"d":"9.7"},{"v":5.132121958731137,"d":"5.1"},{"v":0.7877270472636229,"d":"0.8"}]
[null,null,454,{"$f":"VLOOKUP(Tabelle1[[#This Row],[Spalte1]],AGS_Namen!$C$1:$D$58,2,FALSE)","v":"Emsland"},{"v":310088,"d":" 310 088"},{"v":311965,"d":" 311 965"},{"v":313533,"d":" 313 533"},{"v":313824,"d":" 313 824"},{"v":313098,"d":" 313 098"},{"v":313056,"d":" 313 056"},{"v":311634,"d":" 311 634"},{"v":312855,"d":" 312 855"},{"v":313689,"d":" 313 689"},{"v":315757,"d":" 315 757"},{"v":319488,"d":" 319 488"},{"v":321391,"d":" 321 391"},{"v":323636,"d":" 323 636"},{"v":325657,"d":" 325 657"},{"v":326954,"d":" 326 954"},{"v":5.439101158380847,"d":"5.4"},{"v":3.546081322029282,"d":"3.5"},{"v":0.3982718013124238,"d":"0.4"}]
[null,null,455,{"$f":"VLOOKUP(Tabelle1[[#This Row],[Spalte1]],AGS_Namen!$C$1:$D$58,2,FALSE)","v":"Friesland"},{"v":101412,"d":" 101 412"},{"v":101192,"d":" 101 192"},{"v":100779,"d":" 100 779"},{"v":100307,"d":" 100 307"},{"v":99851,"d":" 99 851"},{"v":99598,"d":" 99 598"},{"v":97857,"d":" 97 857"},{"v":97327,"d":" 97 327"},{"v":97093,"d":" 97 093"},{"v":96937,"d":" 96 937"},{"v":97900,"d":" 97 900"},{"v":98409,"d":" 98 409"},{"v":98509,"d":" 98 509"},{"v":98460,"d":" 98 460"},{"v":98704,"d":" 98 704"},{"v":-2.6702954285488896,"d":"-2.7"},{"v":1.8228333866325552,"d":"1.8"},{"v":0.24781637213081453,"d":"0.2"}]
[null,null,456,{"$f":"VLOOKUP(Tabelle1[[#This Row],[Spalte1]],AGS_Namen!$C$1:$D$58,2,FALSE)","v":"Grafschaft Bentheim"},{"v":134442,"d":" 134 442"},{"v":134840,"d":" 134 840"},{"v":135270,"d":" 135 270"},{"v":135508,"d":" 135 508"},{"v":135346,"d":" 135 346"},{"v":135047,"d":" 135 047"},{"v":133400,"d":" 133 400"},{"v":133652,"d":" 133 652"},{"v":133678,"d":" 133 678"},{"v":134329,"d":" 134 329"},{"v":135662,"d":" 135 662"},{"v":135770,"d":" 135 770"},{"v":135859,"d":" 135 859"},{"v":136511,"d":" 136 511"},{"v":137162,"d":" 137 162"},{"v":2.02317728090924,"d":"2.0"},{"v":2.109001034772834,"d":"2.1"},{"v":0.47688464665851105,"d":"0.5"}]
[null,null,457,{"$f":"VLOOKUP(Tabelle1[[#This Row],[Spalte1]],AGS_Namen!$C$1:$D$58,2,FALSE)","v":"Leer"},{"v":165056,"d":" 165 056"},{"v":165347,"d":" 165 347"},{"v":165088,"d":" 165 088"},{"v":164947,"d":" 164 947"},{"v":164837,"d":" 164 837"},{"v":164705,"d":" 164 705"},{"v":163991,"d":" 163 991"},{"v":164202,"d":" 164 202"},{"v":164792,"d":" 164 792"},{"v":165809,"d":" 165 809"},{"v":167548,"d":" 167 548"},{"v":168253,"d":" 168 253"},{"v":168946,"d":" 168 946"},{"v":169809,"d":" 169 809"},{"v":170756,"d":" 170 756"},{"v":3.453373400542846,"d":"3.5"},{"v":2.983553365619478,"d":"3.0"},{"v":0.5576853994782374,"d":"0.6"}]
[null,null,458,{"$f":"VLOOKUP(Tabelle1[[#This Row],[Spalte1]],AGS_Namen!$C$1:$D$58,2,FALSE)","v":"Oldenburg"},{"v":125731,"d":" 125 731"},{"v":125949,"d":" 125 949"},{"v":126131,"d":" 126 131"},{"v":125943,"d":" 125 943"},{"v":126571,"d":" 126 571"},{"v":127282,"d":" 127 282"},{"v":125265,"d":" 125 265"},{"v":125413,"d":" 125 413"},{"v":125778,"d":" 125 778"},{"v":126798,"d":" 126 798"},{"v":128608,"d":" 128 608"},{"v":129484,"d":" 129 484"},{"v":129924,"d":" 129 924"},{"v":130144,"d":" 130 144"},{"v":130890,"d":" 130 890"},{"v":4.103204460316071,"d":"4.1"},{"v":3.2271802394359534,"d":"3.2"},{"v":0.5732112121957217,"d":"0.6"}]
[null,null,459,{"$f":"VLOOKUP(Tabelle1[[#This Row],[Spalte1]],AGS_Namen!$C$1:$D$58,2,FALSE)","v":"Osnabrück"},{"v":359449,"d":" 359 449"},{"v":359340,"d":" 359 340"},{"v":358852,"d":" 358 852"},{"v":358236,"d":" 358 236"},{"v":357056,"d":" 357 056"},{"v":356123,"d":" 356 123"},{"v":350418,"d":" 350 418"},{"v":350444,"d":" 350 444"},{"v":350302,"d":" 350 302"},{"v":351316,"d":" 351 316"},{"v":358079,"d":" 358 079"},{"v":354807,"d":" 354 807"},{"v":356140,"d":" 356 140"},{"v":357343,"d":" 357 343"},{"v":358080,"d":" 358 080"},{"v":-0.38086070624761786,"d":"-0.4"},{"v":1.925332179576222,"d":"1.9"},{"v":0.2062444206266808,"d":"0.2"}]
[null,null,460,{"$f":"VLOOKUP(Tabelle1[[#This Row],[Spalte1]],AGS_Namen!$C$1:$D$58,2,FALSE)","v":"Vechta"},{"v":132401,"d":" 132 401"},{"v":133104,"d":" 133 104"},{"v":134404,"d":" 134 404"},{"v":134506,"d":" 134 506"},{"v":134838,"d":" 134 838"},{"v":135374,"d":" 135 374"},{"v":132752,"d":" 132 752"},{"v":133462,"d":" 133 462"},{"v":134188,"d":" 134 188"},{"v":136184,"d":" 136 184"},{"v":137866,"d":" 137 866"},{"v":139671,"d":" 139 671"},{"v":140540,"d":" 140 540"},{"v":141598,"d":" 141 598"},{"v":142814,"d":" 142 814"},{"v":7.864744223986223,"d":"7.9"},{"v":4.868413323151031,"d":"4.9"},{"v":0.8587691916552493,"d":"0.9"}]
[null,null,461,{"$f":"VLOOKUP(Tabelle1[[#This Row],[Spalte1]],AGS_Namen!$C$1:$D$58,2,FALSE)","v":"Wesermarsch"},{"v":93725,"d":" 93 725"},{"v":93094,"d":" 93 094"},{"v":92622,"d":" 92 622"},{"v":91968,"d":" 91 968"},{"v":91228,"d":" 91 228"},{"v":90772,"d":" 90 772"},{"v":89527,"d":" 89 527"},{"v":89126,"d":" 89 126"},{"v":88831,"d":" 88 831"},{"v":88765,"d":" 88 765"},{"v":89239,"d":" 89 239"},{"v":89282,"d":" 89 282"},{"v":89022,"d":" 89 022"},{"v":88624,"d":" 88 624"},{"v":88583,"d":" 88 583"},{"v":-5.486263003467592,"d":"-5.5"},{"v":-0.20503576860248973,"d":"-0.2"},{"v":-0.04626286333273154,"d":"-0.0"}]
[null,null,462,{"$f":"VLOOKUP(Tabelle1[[#This Row],[Spalte1]],AGS_Namen!$C$1:$D$58,2,FALSE)","v":"Wittmund"},{"v":57954,"d":" 57 954"},{"v":57829,"d":" 57 829"},{"v":57742,"d":" 57 742"},{"v":57492,"d":" 57 492"},{"v":57391,"d":" 57 391"},{"v":57280,"d":" 57 280"},{"v":56572,"d":" 56 572"},{"v":56362,"d":" 56 362"},{"v":56400,"d":" 56 400"},{"v":56539,"d":" 56 539"},{"v":57173,"d":" 57 173"},{"v":56881,"d":" 56 881"},{"v":56731,"d":" 56 731"},{"v":56882,"d":" 56 882"},{"v":56926,"d":" 56 926"},{"v":-1.773820616350899,"d":"-1.8"},{"v":0.6844832770300147,"d":"0.7"},{"v":0.07735311697900918,"d":"0.1"}]
[null,null,4,{"$f":"VLOOKUP(Tabelle1[[#This Row],[Spalte1]],AGS_Namen!$C$1:$D$58,2,FALSE)","v":"Stat. Region Weser-Ems"},{"v":2475459,"d":"2 475 459"},{"v":2477718,"d":"2 477 718"},{"v":2480393,"d":"2 480 393"},{"v":2477771,"d":"2 477 771"},{"v":2476001,"d":"2 476 001"},{"v":2477975,"d":"2 477 975"},{"v":2437727,"d":"2 437 727"},{"v":2442205,"d":"2 442 205"},{"v":2446345,"d":"2 446 345"},{"v":2460857,"d":"2 460 857"},{"v":2496176,"d":"2 496 176"},{"v":2506155,"d":"2 506 155"},{"v":2516457,"d":"2 516 457"},{"v":2525333,"d":"2 525 333"},{"v":2533993,"d":"2 533 993"},{"v":2.3645715804624516,"d":"2.4"},{"v":2.9719727720871223,"d":"3.0"},{"v":0.3429250716638162,"d":"0.3"}]
[null,null,0,{"$f":"VLOOKUP(Tabelle1[[#This Row],[Spalte1]],AGS_Namen!$C$1:$D$58,2,FALSE)","v":"Niedersachsen"},{"v":7993946,"d":"7 993 946"},{"v":7982685,"d":"7 982 685"},{"v":7971684,"d":"7 971 684"},{"v":7947244,"d":"7 947 244"},{"v":7928815,"d":"7 928 815"},{"v":7918293,"d":"7 918 293"},{"v":7774253,"d":"7 774 253"},{"v":7778995,"d":"7 778 995"},{"v":7790559,"d":"7 790 559"},{"v":7826739,"d":"7 826 739"},{"v":7926599,"d":"7 926 599"},{"v":7945685,"d":"7 945 685"},{"v":7962775,"d":"7 962 775"},{"v":7982448,"d":"7 982 448"},{"v":7993608,"d":"7 993 608"},{"v":-0.004228199690115495,"d":"-0.0"},{"v":2.132037365753477,"d":"2.1"},{"v":0.13980673597873736,"d":"0.1"}]
[]
[]
[]
[]
[]
[{"$nulls":3},"1) Im Berichtsjahr 2011 erfolgte die Umstellung auf die Ergebnisse des Zensus 2011 als neue Basis für die Bevölkerungsfortschreibung. Aufgrund der unterschiedlichen Fortschreibungsbasis ist die Vergleichbarkeit der einzelnen Jahre untereinander eingeschränkt."]
[]
[]
[{"$nulls":3},"Quelle: Bevölkerungsfortschreibung"]
[]
[{"$nulls":3},"Karte A1-2: Veränderung der Zahl der Einwohnerinnen und Einwohner vom 31.12.2019 gegenüber 31.12.2018 in Prozent"]
{"$rows_empty":39}
[{"$nulls":3},"Die Definition zu dem Indikator sowie methodische Hinweise finden Sie in der Tabelle Aktuelle Ergebnisse"]
[{"$nulls":3},"Link zur LSN-Online-Datenbank"]
[{"$nulls":3},"Link zum Regionalmonitoring Niedersachsen"]

{"sheet":"A2","index":7,"n_rows":120,"n_cols":21,"rows_kept":120,"merged":[[2,2,2,4],[7,1,9,1],[7,2,9,2],[7,3,7,14],[7,18,7,20],[9,3,9,14],[9,18,9,20],[68,2,68,20],[77,2,77,13]]}
[null,null,{"$f":"Kopf","v":"Migration und Teilhabe in Niedersachsen - Integrationsmonitoring 2020 - Regionalinformationen "}]
[]
[]
[]
[null,null,"Indikator A2: Ausländerinnen und Ausländer in Niedersachsen "]
[null,null,"Tabelle A2-2: Ausländerinnen und Ausländer 2005 bis 2019 nach Kreisen"]
[]
[null,"AGS","Kreisfreie Stadt\nLandkreis\n(Großstadt, Umland)\nStatistische Region\nLand","Ausländerinnen und Ausländer am 31.12.",{"$nulls":14},"Anteil an der Bevölkerung1)"]
[{"$nulls":3},2005,2006,2007,2008,2009,2010,2011,2012,2013,2014,2015,2016,2017,2018,2019,2005,2016,2019]
[{"$nulls":3},"Anzahl",{"$nulls":14},"Prozent"]
[null,"AGS","1","2","3","4","5","6","7","8","9","10","11","12","13","14","15","16","17","18","19"]
[null,{"v":101,"d":"101.00"},{"$f":"VLOOKUP(Tabelle2[[#This Row],[AGS]],AGS_Namen!$C$1:$D$58,2,FALSE)","v":"Braunschweig, Stadt"},{"v":20275,"d":" 20 275"},{"v":20282,"d":" 20 282"},{"v":19875,"d":" 19 875"},{"v":19402,"d":" 19 402"},{"v":19399,"d":" 19 399"},{"v":19660,"d":" 19 660"},{"v":20214,"d":" 20 214"},{"v":20820,"d":" 20 820"},{"v":22122,"d":" 22 122"},{"v":23055,"d":" 23 055"},{"v":26108,"d":" 26 108"},{"v":28200,"d":" 28 200"},{"v":28420,"d":" 28 420"},{"v":29730,"d":" 29 730"},{"v":31445,"d":" 31 445"},8.3,11.3,12.6]
[null,{"v":102,"d":"102.00"},{"$f":"VLOOKUP(Tabelle2[[#This Row],[AGS]],AGS_Namen!$C$1:$D$58,2,FALSE)","v":"Salzgitter, Stadt"},{"v":10721,"d":" 10 721"},{"v":10474,"d":" 10 474"},{"v":10224,"d":" 10 224"},{"v":10191,"d":" 10 191"},{"v":10062,"d":" 10 062"},{"v":9810,"d":" 9 810"},{"v":9804,"d":" 9 804"},{"v":9918,"d":" 9 918"},{"v":10596,"d":" 10 596"},{"v":11620,"d":" 11 620"},{"v":13554,"d":" 13 554"},{"v":16885,"d":" 16 885"},{"v":18835,"d":" 18 835"},{"v":19850,"d":" 19 850"},{"v":20175,"d":" 20 175"},{"v":10,"d":"10.0"},16.3,19.3]
[null,{"v":103,"d":"103.00"},{"$f":"VLOOKUP(Tabelle2[[#This Row],[AGS]],AGS_Namen!$C$1:$D$58,2,FALSE)","v":"Wolfsburg, Stadt"},{"v":11986,"d":" 11 986"},{"v":11941,"d":" 11 941"},{"v":11772,"d":" 11 772"},{"v":11824,"d":" 11 824"},{"v":11796,"d":" 11 796"},{"v":11804,"d":" 11 804"},{"v":12080,"d":" 12 080"},{"v":12680,"d":" 12 680"},{"v":14017,"d":" 14 017"},{"v":15224,"d":" 15 224"},{"v":16966,"d":" 16 966"},{"v":17770,"d":" 17 770"},{"v":18420,"d":" 18 420"},{"v":19325,"d":" 19 325"},{"v":20160,"d":" 20 160"},9.9,14.3,16.2]
[null,{"v":151,"d":"151.00"},{"$f":"VLOOKUP(Tabelle2[[#This Row],[AGS]],AGS_Namen!$C$1:$D$58,2,FALSE)","v":"Gifhorn"},{"v":7612,"d":" 7 612"},{"v":7371,"d":" 7 371"},{"v":7223,"d":" 7 223"},{"v":7038,"d":" 7 038"},{"v":7058,"d":" 7 058"},{"v":7024,"d":" 7 024"},{"v":7135,"d":" 7 135"},{"v":7552,"d":" 7 552"},{"v":7991,"d":" 7 991"},{"v":8866,"d":" 8 866"},{"v":9857,"d":" 9 857"},{"v":10840,"d":" 10 840"},{"v":11140,"d":" 11 140"},{"v":11810,"d":" 11 810"},{"v":12330,"d":" 12 330"},4.3,6.2,{"v":7,"d":"7.0"}]
[null,{"v":153,"d":"153.00"},{"$f":"VLOOKUP(Tabelle2[[#This Row],[AGS]],AGS_Namen!$C$1:$D$58,2,FALSE)","v":"Goslar"},{"v":7506,"d":" 7 506"},{"v":7325,"d":" 7 325"},{"v":7231,"d":" 7 231"},{"v":7086,"d":" 7 086"},{"v":7041,"d":" 7 041"},{"v":6980,"d":" 6 980"},{"v":7059,"d":" 7 059"},{"v":7419,"d":" 7 419"},{"v":7947,"d":" 7 947"},{"v":8634,"d":" 8 634"},{"v":10620,"d":" 10 620"},{"v":11745,"d":" 11 745"},{"v":12780,"d":" 12 780"},{"v":13455,"d":" 13 455"},{"v":14020,"d":" 14 020"},{"v":5,"d":"5.0"},8.5,10.3]
[null,{"v":154,"d":"154.00"},{"$f":"VLOOKUP(Tabelle2[[#This Row],[AGS]],AGS_Namen!$C$1:$D$58,2,FALSE)","v":"Helmstedt"},{"v":3648,"d":" 3 648"},{"v":3620,"d":" 3 620"},{"v":3498,"d":" 3 498"},{"v":3392,"d":" 3 392"},{"v":3352,"d":" 3 352"},{"v":3365,"d":" 3 365"},{"v":3394,"d":" 3 394"},{"v":3404,"d":" 3 404"},{"v":3682,"d":" 3 682"},{"v":4100,"d":" 4 100"},{"v":5221,"d":" 5 221"},{"v":6230,"d":" 6 230"},{"v":6415,"d":" 6 415"},{"v":6485,"d":" 6 485"},{"v":6535,"d":" 6 535"},3.7,6.8,7.2]
[null,{"v":155,"d":"155.00"},{"$f":"VLOOKUP(Tabelle2[[#This Row],[AGS]],AGS_Namen!$C$1:$D$58,2,FALSE)","v":"Northeim"},{"v":5806,"d":" 5 806"},{"v":5607,"d":" 5 607"},{"v":5438,"d":" 5 438"},{"v":5213,"d":" 5 213"},{"v":5115,"d":" 5 115"},{"v":5093,"d":" 5 093"},{"v":5094,"d":" 5 094"},{"v":5113,"d":" 5 113"},{"v":5406,"d":" 5 406"},{"v":5924,"d":" 5 924"},{"v":7164,"d":" 7 164"},{"v":8245,"d":" 8 245"},{"v":8440,"d":" 8 440"},{"v":8805,"d":" 8 805"},{"v":9225,"d":" 9 225"},{"v":4,"d":"4.0"},6.2,{"v":7,"d":"7.0"}]
[null,{"v":157,"d":"157.00"},{"$f":"VLOOKUP(Tabelle2[[#This Row],[AGS]],AGS_Namen!$C$1:$D$58,2,FALSE)","v":"Peine"},{"v":6834,"d":" 6 834"},{"v":6676,"d":" 6 676"},{"v":6488,"d":" 6 488"},{"v":6382,"d":" 6 382"},{"v":6401,"d":" 6 401"},{"v":6373,"d":" 6 373"},{"v":6369,"d":" 6 369"},{"v":6508,"d":" 6 508"},{"v":6874,"d":" 6 874"},{"v":7401,"d":" 7 401"},{"v":9059,"d":" 9 059"},{"v":9910,"d":" 9 910"},{"v":10415,"d":" 10 415"},{"v":11035,"d":" 11 035"},{"v":11340,"d":" 11 340"},5.1,7.5,8.4]
[null,{"v":158,"d":"158.00"},{"$f":"VLOOKUP(Tabelle2[[#This Row],[AGS]],AGS_Namen!$C$1:$D$58,2,FALSE)","v":"Wolfenbüttel"},{"v":4886,"d":" 4 886"},{"v":4660,"d":" 4 660"},{"v":4529,"d":" 4 529"},{"v":4489,"d":" 4 489"},{"v":4392,"d":" 4 392"},{"v":4440,"d":" 4 440"},{"v":4509,"d":" 4 509"},{"v":4690,"d":" 4 690"},{"v":5051,"d":" 5 051"},{"v":5432,"d":" 5 432"},{"v":6675,"d":" 6 675"},{"v":7290,"d":" 7 290"},{"v":7345,"d":" 7 345"},{"v":7515,"d":" 7 515"},{"v":7675,"d":" 7 675"},3.9,{"v":6,"d":"6.0"},6.4]
[null,{"v":159,"d":"159.00"},{"$f":"VLOOKUP(Tabelle2[[#This Row],[AGS]],AGS_Namen!$C$1:$D$58,2,FALSE)","v":"Göttingen"},{"v":20262,"d":" 20 262"},{"v":19719,"d":" 19 719"},{"v":19098,"d":" 19 098"},{"v":18578,"d":" 18 578"},{"v":18869,"d":" 18 869"},{"v":18518,"d":" 18 518"},{"v":18911,"d":" 18 911"},{"v":19708,"d":" 19 708"},{"v":20862,"d":" 20 862"},{"v":22278,"d":" 22 278"},{"v":25709,"d":" 25 709"},{"v":28035,"d":" 28 035"},{"v":28955,"d":" 28 955"},{"v":30170,"d":" 30 170"},{"v":32090,"d":" 32 090"},5.9,8.6,9.8]
[null,{"v":159016,"d":"159016.00"},{"$f":"VLOOKUP(Tabelle2[[#This Row],[AGS]],AGS_Namen!$C$1:$D$58,2,FALSE)","v":"   dav. Göttingen, Stadt"},"-","-",{"v":11014,"d":" 11 014"},{"v":10769,"d":" 10 769"},{"v":10911,"d":" 10 911"},{"v":10752,"d":" 10 752"},{"v":10891,"d":" 10 891"},{"v":11352,"d":" 11 352"},{"v":12269,"d":" 12 269"},{"v":13391,"d":" 13 391"},{"v":15410,"d":" 15 410"},{"v":15650,"d":" 15 650"},{"v":16270,"d":" 16 270"},{"v":17265,"d":" 17 265"},{"v":18815,"d":" 18 815"},"-",13.1,15.8]
[null,{"v":159999,"d":"159999.00"},{"$f":"VLOOKUP(Tabelle2[[#This Row],[AGS]],AGS_Namen!$C$1:$D$58,2,FALSE)","v":"   dav. Göttingen, Umland"},"-","-",{"v":8084,"d":" 8 084"},{"v":7809,"d":" 7 809"},{"v":7958,"d":" 7 958"},{"v":7766,"d":" 7 766"},{"v":8020,"d":" 8 020"},{"v":8356,"d":" 8 356"},{"v":8593,"d":" 8 593"},{"v":8887,"d":" 8 887"},{"v":10299,"d":" 10 299"},{"v":12385,"d":" 12 385"},{"v":12685,"d":" 12 685"},{"v":12905,"d":" 12 905"},{"v":13275,"d":" 13 275"},"-",{"v":5.957534826445009,"d":"6.0"},{"v":6.409018490802877,"d":"6.4"}]
[null,{"v":1,"d":"1.00"},{"$f":"VLOOKUP(Tabelle2[[#This Row],[AGS]],AGS_Namen!$C$1:$D$58,2,FALSE)","v":"Stat. Region Braunschweig"},{"v":99536,"d":" 99 536"},{"v":97675,"d":" 97 675"},{"v":95376,"d":" 95 376"},{"v":93595,"d":" 93 595"},{"v":93485,"d":" 93 485"},{"v":93067,"d":" 93 067"},{"v":94569,"d":" 94 569"},{"v":97812,"d":" 97 812"},{"v":104548,"d":" 104 548"},{"v":112534,"d":" 112 534"},{"v":130933,"d":" 130 933"},{"v":145155,"d":" 145 155"},{"v":151170,"d":" 151 170"},{"v":158180,"d":" 158 180"},{"v":165000,"d":" 165 000"},{"v":6,"d":"6.0"},9.1,10.3]
[null,{"v":241,"d":"241.00"},{"$f":"VLOOKUP(Tabelle2[[#This Row],[AGS]],AGS_Namen!$C$1:$D$58,2,FALSE)","v":"Hannover, Region"},{"v":115165,"d":" 115 165"},{"v":115063,"d":" 115 063"},{"v":114709,"d":" 114 709"},{"v":112514,"d":" 112 514"},{"v":111911,"d":" 111 911"},{"v":112021,"d":" 112 021"},{"v":115062,"d":" 115 062"},{"v":119366,"d":" 119 366"},{"v":126962,"d":" 126 962"},{"v":136533,"d":" 136 533"},{"v":154696,"d":" 154 696"},{"v":168735,"d":" 168 735"},{"v":175170,"d":" 175 170"},{"v":181570,"d":" 181 570"},{"v":185310,"d":" 185 310"},10.2,14.7,{"v":16,"d":"16.0"}]
[null,{"v":241001,"d":"241001.00"},{"$f":"VLOOKUP(Tabelle2[[#This Row],[AGS]],AGS_Namen!$C$1:$D$58,2,FALSE)","v":"   dav. Hannover, Lhst."},{"v":75016,"d":" 75 016"},{"v":74898,"d":" 74 898"},{"v":74977,"d":" 74 977"},{"v":74111,"d":" 74 111"},{"v":73483,"d":" 73 483"},{"v":73448,"d":" 73 448"},{"v":75793,"d":" 75 793"},{"v":78442,"d":" 78 442"},{"v":82727,"d":" 82 727"},{"v":88541,"d":" 88 541"},{"v":97357,"d":" 97 357"},{"v":104465,"d":" 104 465"},{"v":107965,"d":" 107 965"},{"v":111255,"d":" 111 255"},{"v":113440,"d":" 113 440"},14.5,19.6,21.1]
[null,{"v":241999,"d":"241999.00"},{"$f":"VLOOKUP(Tabelle2[[#This Row],[AGS]],AGS_Namen!$C$1:$D$58,2,FALSE)","v":"   dav. Hannover, Umland"},{"v":40149,"d":" 40 149"},{"v":40165,"d":" 40 165"},{"v":39732,"d":" 39 732"},{"v":38403,"d":" 38 403"},{"v":38428,"d":" 38 428"},{"v":38573,"d":" 38 573"},{"v":39269,"d":" 39 269"},{"v":40924,"d":" 40 924"},{"v":44235,"d":" 44 235"},{"v":47992,"d":" 47 992"},{"v":57339,"d":" 57 339"},{"v":64270,"d":" 64 270"},{"v":67205,"d":" 67 205"},{"v":70315,"d":" 70 315"},{"v":71870,"d":" 71 870"},{"v":6.551580087922273,"d":"6.6"},{"v":10.436220032606084,"d":"10.4"},{"v":11.588384204840452,"d":"11.6"}]
[null,{"v":251,"d":"251.00"},{"$f":"VLOOKUP(Tabelle2[[#This Row],[AGS]],AGS_Namen!$C$1:$D$58,2,FALSE)","v":"Diepholz"},{"v":8256,"d":" 8 256"},{"v":8139,"d":" 8 139"},{"v":8229,"d":" 8 229"},{"v":8105,"d":" 8 105"},{"v":8099,"d":" 8 099"},{"v":8183,"d":" 8 183"},{"v":8386,"d":" 8 386"},{"v":9184,"d":" 9 184"},{"v":10761,"d":" 10 761"},{"v":11631,"d":" 11 631"},{"v":13826,"d":" 13 826"},{"v":15540,"d":" 15 540"},{"v":16065,"d":" 16 065"},{"v":17565,"d":" 17 565"},{"v":18545,"d":" 18 545"},3.8,7.2,8.5]
[null,{"v":252,"d":"252.00"},{"$f":"VLOOKUP(Tabelle2[[#This Row],[AGS]],AGS_Namen!$C$1:$D$58,2,FALSE)","v":"Hameln-Pyrmont"},{"v":11014,"d":" 11 014"},{"v":10617,"d":" 10 617"},{"v":10381,"d":" 10 381"},{"v":10213,"d":" 10 213"},{"v":10154,"d":" 10 154"},{"v":10394,"d":" 10 394"},{"v":10319,"d":" 10 319"},{"v":10342,"d":" 10 342"},{"v":10719,"d":" 10 719"},{"v":11665,"d":" 11 665"},{"v":13461,"d":" 13 461"},{"v":15065,"d":" 15 065"},{"v":15795,"d":" 15 795"},{"v":16535,"d":" 16 535"},{"v":16910,"d":" 16 910"},6.9,10.2,11.4]
[null,{"v":254,"d":"254.00"},{"$f":"VLOOKUP(Tabelle2[[#This Row],[AGS]],AGS_Namen!$C$1:$D$58,2,FALSE)","v":"Hildesheim"},{"v":14631,"d":" 14 631"},{"v":14237,"d":" 14 237"},{"v":13889,"d":" 13 889"},{"v":13669,"d":" 13 669"},{"v":13466,"d":" 13 466"},{"v":13637,"d":" 13 637"},{"v":13859,"d":" 13 859"},{"v":14417,"d":" 14 417"},{"v":15353,"d":" 15 353"},{"v":16412,"d":" 16 412"},{"v":19567,"d":" 19 567"},{"v":21915,"d":" 21 915"},{"v":22775,"d":" 22 775"},{"v":24090,"d":" 24 090"},{"v":24995,"d":" 24 995"},{"v":5,"d":"5.0"},7.9,9.1]
[null,{"v":254021,"d":"254021.00"},{"$f":"VLOOKUP(Tabelle2[[#This Row],[AGS]],AGS_Namen!$C$1:$D$58,2,FALSE)","v":"Hildesheim, Stadt"},"-","-",{"v":8448,"d":" 8 448"},{"v":8344,"d":" 8 344"},{"v":8279,"d":" 8 279"},{"v":8445,"d":" 8 445"},{"v":8609,"d":" 8 609"},{"v":8826,"d":" 8 826"},{"v":9212,"d":" 9 212"},{"v":9796,"d":" 9 796"},{"v":11180,"d":" 11 180"},{"v":12505,"d":" 12 505"},{"v":13285,"d":" 13 285"},{"v":14425,"d":" 14 425"},{"v":14830,"d":" 14 830"},"-",12.3,14.6]
[null,{"v":254999,"d":"254999.00"},{"$f":"VLOOKUP(Tabelle2[[#This Row],[AGS]],AGS_Namen!$C$1:$D$58,2,FALSE)","v":"Hildesheim, Umland"},"-","-",{"v":5441,"d":" 5 441"},{"v":5325,"d":" 5 325"},{"v":5187,"d":" 5 187"},{"v":5192,"d":" 5 192"},{"v":5250,"d":" 5 250"},{"v":5591,"d":" 5 591"},{"v":6141,"d":" 6 141"},{"v":6616,"d":" 6 616"},{"v":8387,"d":" 8 387"},{"v":9410,"d":" 9 410"},{"v":9490,"d":" 9 490"},{"v":9665,"d":" 9 665"},{"v":10165,"d":" 10 165"},"-",{"v":5.358373241160962,"d":"5.4"},{"v":5.837793756173761,"d":"5.8"}]
[null,{"v":255,"d":"255.00"},{"$f":"VLOOKUP(Tabelle2[[#This Row],[AGS]],AGS_Namen!$C$1:$D$58,2,FALSE)","v":"Holzminden"},{"v":3433,"d":" 3 433"},{"v":3274,"d":" 3 274"},{"v":3213,"d":" 3 213"},{"v":3109,"d":" 3 109"},{"v":3033,"d":" 3 033"},{"v":3063,"d":" 3 063"},{"v":3100,"d":" 3 100"},{"v":3072,"d":" 3 072"},{"v":3094,"d":" 3 094"},{"v":3131,"d":" 3 131"},{"v":3855,"d":" 3 855"},{"v":4300,"d":" 4 300"},{"v":4350,"d":" 4 350"},{"v":4330,"d":" 4 330"},{"v":4275,"d":" 4 275"},4.4,{"v":6,"d":"6.0"},6.1]
[null,{"v":256,"d":"256.00"},{"$f":"VLOOKUP(Tabelle2[[#This Row],[AGS]],AGS_Namen!$C$1:$D$58,2,FALSE)","v":"Nienburg (Weser)"},{"v":5488,"d":" 5 488"},{"v":5402,"d":" 5 402"},{"v":5316,"d":" 5 316"},{"v":5301,"d":" 5 301"},{"v":5184,"d":" 5 184"},{"v":5160,"d":" 5 160"},{"v":5252,"d":" 5 252"},{"v":5374,"d":" 5 374"},{"v":5829,"d":" 5 829"},{"v":6299,"d":" 6 299"},{"v":7452,"d":" 7 452"},{"v":9380,"d":" 9 380"},{"v":10010,"d":" 10 010"},{"v":10430,"d":" 10 430"},{"v":10345,"d":" 10 345"},4.4,7.7,8.5]
[null,{"v":257,"d":"257.00"},{"$f":"VLOOKUP(Tabelle2[[#This Row],[AGS]],AGS_Namen!$C$1:$D$58,2,FALSE)","v":"Schaumburg"},{"v":9608,"d":" 9 608"},{"v":9138,"d":" 9 138"},{"v":8895,"d":" 8 895"},{"v":8498,"d":" 8 498"},{"v":8456,"d":" 8 456"},{"v":8342,"d":" 8 342"},{"v":8341,"d":" 8 341"},{"v":8491,"d":" 8 491"},{"v":8854,"d":" 8 854"},{"v":9526,"d":" 9 526"},{"v":10716,"d":" 10 716"},{"v":12600,"d":" 12 600"},{"v":13545,"d":" 13 545"},{"v":13985,"d":" 13 985"},{"v":14255,"d":" 14 255"},5.8,{"v":8,"d":"8.0"},{"v":9,"d":"9.0"}]
[null,{"v":2,"d":"2.00"},{"$f":"VLOOKUP(Tabelle2[[#This Row],[AGS]],AGS_Namen!$C$1:$D$58,2,FALSE)","v":"Stat. Region Hannover"},{"v":167595,"d":" 167 595"},{"v":165870,"d":" 165 870"},{"v":164632,"d":" 164 632"},{"v":161409,"d":" 161 409"},{"v":160303,"d":" 160 303"},{"v":160800,"d":" 160 800"},{"v":164319,"d":" 164 319"},{"v":170246,"d":" 170 246"},{"v":181572,"d":" 181 572"},{"v":195197,"d":" 195 197"},{"v":223573,"d":" 223 573"},{"v":247535,"d":" 247 535"},{"v":257705,"d":" 257 705"},{"v":268505,"d":" 268 505"},{"v":274635,"d":" 274 635"},7.7,11.6,12.8]
[null,{"v":351,"d":"351.00"},{"$f":"VLOOKUP(Tabelle2[[#This Row],[AGS]],AGS_Namen!$C$1:$D$58,2,FALSE)","v":"Celle"},{"v":7805,"d":" 7 805"},{"v":7594,"d":" 7 594"},{"v":7394,"d":" 7 394"},{"v":7449,"d":" 7 449"},{"v":7472,"d":" 7 472"},{"v":7584,"d":" 7 584"},{"v":7689,"d":" 7 689"},{"v":7959,"d":" 7 959"},{"v":8519,"d":" 8 519"},{"v":9503,"d":" 9 503"},{"v":10974,"d":" 10 974"},{"v":12675,"d":" 12 675"},{"v":13430,"d":" 13 430"},{"v":14130,"d":" 14 130"},{"v":14330,"d":" 14 330"},4.3,7.1,{"v":8,"d":"8.0"}]
[null,{"v":352,"d":"352.00"},{"$f":"VLOOKUP(Tabelle2[[#This Row],[AGS]],AGS_Namen!$C$1:$D$58,2,FALSE)","v":"Cuxhaven"},{"v":8730,"d":" 8 730"},{"v":8486,"d":" 8 486"},{"v":8328,"d":" 8 328"},{"v":8238,"d":" 8 238"},{"v":8184,"d":" 8 184"},{"v":8131,"d":" 8 131"},{"v":8134,"d":" 8 134"},{"v":8167,"d":" 8 167"},{"v":8660,"d":" 8 660"},{"v":9787,"d":" 9 787"},{"v":11863,"d":" 11 863"},{"v":13215,"d":" 13 215"},{"v":13215,"d":" 13 215"},{"v":13335,"d":" 13 335"},{"v":13345,"d":" 13 345"},4.3,6.7,6.7]
[null,{"v":353,"d":"353.00"},{"$f":"VLOOKUP(Tabelle2[[#This Row],[AGS]],AGS_Namen!$C$1:$D$58,2,FALSE)","v":"Harburg"},{"v":11011,"d":" 11 011"},{"v":10667,"d":" 10 667"},{"v":10514,"d":" 10 514"},{"v":10670,"d":" 10 670"},{"v":10975,"d":" 10 975"},{"v":11183,"d":" 11 183"},{"v":11025,"d":" 11 025"},{"v":11307,"d":" 11 307"},{"v":11651,"d":" 11 651"},{"v":12035,"d":" 12 035"},{"v":13092,"d":" 13 092"},{"v":16015,"d":" 16 015"},{"v":17475,"d":" 17 475"},{"v":18930,"d":" 18 930"},{"v":21285,"d":" 21 285"},4.6,6.4,8.4]
[null,{"v":354,"d":"354.00"},{"$f":"VLOOKUP(Tabelle2[[#This Row],[AGS]],AGS_Namen!$C$1:$D$58,2,FALSE)","v":"Lüchow-Dannenberg"},{"v":1273,"d":" 1 273"},{"v":1267,"d":" 1 267"},{"v":1301,"d":" 1 301"},{"v":1372,"d":" 1 372"},{"v":1464,"d":" 1 464"},{"v":1487,"d":" 1 487"},{"v":1456,"d":" 1 456"},{"v":1601,"d":" 1 601"},{"v":1882,"d":" 1 882"},{"v":2244,"d":" 2 244"},{"v":2767,"d":" 2 767"},{"v":2825,"d":" 2 825"},{"v":2585,"d":" 2 585"},{"v":2665,"d":" 2 665"},{"v":2785,"d":" 2 785"},2.5,5.8,5.8]
[null,{"v":355,"d":"355.00"},{"$f":"VLOOKUP(Tabelle2[[#This Row],[AGS]],AGS_Namen!$C$1:$D$58,2,FALSE)","v":"Lüneburg"},{"v":6903,"d":" 6 903"},{"v":6746,"d":" 6 746"},{"v":6556,"d":" 6 556"},{"v":6390,"d":" 6 390"},{"v":6394,"d":" 6 394"},{"v":6385,"d":" 6 385"},{"v":6645,"d":" 6 645"},{"v":6993,"d":" 6 993"},{"v":7514,"d":" 7 514"},{"v":8364,"d":" 8 364"},{"v":9418,"d":" 9 418"},{"v":11800,"d":" 11 800"},{"v":12105,"d":" 12 105"},{"v":12760,"d":" 12 760"},{"v":13120,"d":" 13 120"},3.9,6.5,7.1]
[null,{"v":356,"d":"356.00"},{"$f":"VLOOKUP(Tabelle2[[#This Row],[AGS]],AGS_Namen!$C$1:$D$58,2,FALSE)","v":"Osterholz"},{"v":3984,"d":" 3 984"},{"v":3951,"d":" 3 951"},{"v":3915,"d":" 3 915"},{"v":3854,"d":" 3 854"},{"v":3793,"d":" 3 793"},{"v":3766,"d":" 3 766"},{"v":3961,"d":" 3 961"},{"v":4181,"d":" 4 181"},{"v":4489,"d":" 4 489"},{"v":5090,"d":" 5 090"},{"v":6083,"d":" 6 083"},{"v":6210,"d":" 6 210"},{"v":6360,"d":" 6 360"},{"v":6560,"d":" 6 560"},{"v":6715,"d":" 6 715"},3.5,5.5,5.9]
[null,{"v":357,"d":"357.00"},{"$f":"VLOOKUP(Tabelle2[[#This Row],[AGS]],AGS_Namen!$C$1:$D$58,2,FALSE)","v":"Rotenburg (Wümme)"},{"v":6581,"d":" 6 581"},{"v":6516,"d":" 6 516"},{"v":6495,"d":" 6 495"},{"v":6402,"d":" 6 402"},{"v":6292,"d":" 6 292"},{"v":6172,"d":" 6 172"},{"v":6347,"d":" 6 347"},{"v":6657,"d":" 6 657"},{"v":7204,"d":" 7 204"},{"v":7962,"d":" 7 962"},{"v":9727,"d":" 9 727"},{"v":10720,"d":" 10 720"},{"v":10845,"d":" 10 845"},{"v":11145,"d":" 11 145"},{"v":11585,"d":" 11 585"},{"v":4,"d":"4.0"},6.6,7.1]
[null,{"v":358,"d":"358.00"},{"$f":"VLOOKUP(Tabelle2[[#This Row],[AGS]],AGS_Namen!$C$1:$D$58,2,FALSE)","v":"Heidekreis"},{"v":5949,"d":" 5 949"},{"v":5987,"d":" 5 987"},{"v":5929,"d":" 5 929"},{"v":5739,"d":" 5 739"},{"v":5804,"d":" 5 804"},{"v":5915,"d":" 5 915"},{"v":5996,"d":" 5 996"},{"v":6350,"d":" 6 350"},{"v":7260,"d":" 7 260"},{"v":7825,"d":" 7 825"},{"v":9386,"d":" 9 386"},{"v":11140,"d":" 11 140"},{"v":10920,"d":" 10 920"},{"v":11545,"d":" 11 545"},{"v":12525,"d":" 12 525"},4.2,{"v":8,"d":"8.0"},8.9]
[null,{"v":359,"d":"359.00"},{"$f":"VLOOKUP(Tabelle2[[#This Row],[AGS]],AGS_Namen!$C$1:$D$58,2,FALSE)","v":"Stade"},{"v":8004,"d":" 8 004"},{"v":7920,"d":" 7 920"},{"v":7999,"d":" 7 999"},{"v":8070,"d":" 8 070"},{"v":8139,"d":" 8 139"},{"v":8248,"d":" 8 248"},{"v":8854,"d":" 8 854"},{"v":9454,"d":" 9 454"},{"v":10570,"d":" 10 570"},{"v":11524,"d":" 11 524"},{"v":14684,"d":" 14 684"},{"v":16345,"d":" 16 345"},{"v":17280,"d":" 17 280"},{"v":18555,"d":" 18 555"},{"v":19385,"d":" 19 385"},4.1,8.1,9.5]
[null,{"v":360,"d":"360.00"},{"$f":"VLOOKUP(Tabelle2[[#This Row],[AGS]],AGS_Namen!$C$1:$D$58,2,FALSE)","v":"Uelzen"},{"v":2786,"d":" 2 786"},{"v":2742,"d":" 2 742"},{"v":2695,"d":" 2 695"},{"v":2550,"d":" 2 550"},{"v":2527,"d":" 2 527"},{"v":2555,"d":" 2 555"},{"v":2563,"d":" 2 563"},{"v":2634,"d":" 2 634"},{"v":3031,"d":" 3 031"},{"v":3588,"d":" 3 588"},{"v":4184,"d":" 4 184"},{"v":5020,"d":" 5 020"},{"v":5335,"d":" 5 335"},{"v":5605,"d":" 5 605"},{"v":5765,"d":" 5 765"},2.9,5.4,6.2]
[null,{"v":361,"d":"361.00"},{"$f":"VLOOKUP(Tabelle2[[#This Row],[AGS]],AGS_Namen!$C$1:$D$58,2,FALSE)","v":"Verden"},{"v":6736,"d":" 6 736"},{"v":6710,"d":" 6 710"},{"v":6576,"d":" 6 576"},{"v":6545,"d":" 6 545"},{"v":6485,"d":" 6 485"},{"v":6525,"d":" 6 525"},{"v":6554,"d":" 6 554"},{"v":6669,"d":" 6 669"},{"v":7060,"d":" 7 060"},{"v":7644,"d":" 7 644"},{"v":9177,"d":" 9 177"},{"v":10055,"d":" 10 055"},{"v":10510,"d":" 10 510"},{"v":10975,"d":" 10 975"},{"v":11175,"d":" 11 175"},{"v":5,"d":"5.0"},7.4,8.1]
[null,{"v":3,"d":"3.00"},{"$f":"VLOOKUP(Tabelle2[[#This Row],[AGS]],AGS_Namen!$C$1:$D$58,2,FALSE)","v":"Stat. Region Lüneburg"},{"v":69762,"d":" 69 762"},{"v":68586,"d":" 68 586"},{"v":67702,"d":" 67 702"},{"v":67279,"d":" 67 279"},{"v":67529,"d":" 67 529"},{"v":67951,"d":" 67 951"},{"v":69224,"d":" 69 224"},{"v":71972,"d":" 71 972"},{"v":77840,"d":" 77 840"},{"v":85566,"d":" 85 566"},{"v":101355,"d":" 101 355"},{"v":116020,"d":" 116 020"},{"v":120060,"d":" 120 060"},{"v":126195,"d":" 126 195"},{"v":132025,"d":" 132 025"},4.1,6.8,7.7]
[null,{"v":401,"d":"401.00"},{"$f":"VLOOKUP(Tabelle2[[#This Row],[AGS]],AGS_Namen!$C$1:$D$58,2,FALSE)","v":"Delmenhorst, Stadt"},{"v":6751,"d":" 6 751"},{"v":6486,"d":" 6 486"},{"v":6323,"d":" 6 323"},{"v":6245,"d":" 6 245"},{"v":6190,"d":" 6 190"},{"v":6102,"d":" 6 102"},{"v":6243,"d":" 6 243"},{"v":6616,"d":" 6 616"},{"v":7163,"d":" 7 163"},{"v":8139,"d":" 8 139"},{"v":10029,"d":" 10 029"},{"v":11225,"d":" 11 225"},{"v":12410,"d":" 12 410"},{"v":12970,"d":" 12 970"},{"v":13220,"d":" 13 220"},8.9,14.6,{"v":17,"d":"17.0"}]
[null,{"v":402,"d":"402.00"},{"$f":"VLOOKUP(Tabelle2[[#This Row],[AGS]],AGS_Namen!$C$1:$D$58,2,FALSE)","v":"Emden, Stadt"},{"v":2783,"d":" 2 783"},{"v":2664,"d":" 2 664"},{"v":2663,"d":" 2 663"},{"v":2585,"d":" 2 585"},{"v":2360,"d":" 2 360"},{"v":2454,"d":" 2 454"},{"v":2487,"d":" 2 487"},{"v":2784,"d":" 2 784"},{"v":3219,"d":" 3 219"},{"v":3641,"d":" 3 641"},{"v":4576,"d":" 4 576"},{"v":4955,"d":" 4 955"},{"v":5420,"d":" 5 420"},{"v":5530,"d":" 5 530"},{"v":5675,"d":" 5 675"},5.4,9.8,11.4]
[null,{"v":403,"d":"403.00"},{"$f":"VLOOKUP(Tabelle2[[#This Row],[AGS]],AGS_Namen!$C$1:$D$58,2,FALSE)","v":"Oldenburg (Oldb), Stadt"},{"v":9884,"d":" 9 884"},{"v":9767,"d":" 9 767"},{"v":9786,"d":" 9 786"},{"v":9419,"d":" 9 419"},{"v":9376,"d":" 9 376"},{"v":9497,"d":" 9 497"},{"v":9409,"d":" 9 409"},{"v":10068,"d":" 10 068"},{"v":10778,"d":" 10 778"},{"v":11523,"d":" 11 523"},{"v":13579,"d":" 13 579"},{"v":15440,"d":" 15 440"},{"v":16595,"d":" 16 595"},{"v":17365,"d":" 17 365"},{"v":18285,"d":" 18 285"},6.2,9.3,10.8]
[null,{"v":404,"d":"404.00"},{"$f":"VLOOKUP(Tabelle2[[#This Row],[AGS]],AGS_Namen!$C$1:$D$58,2,FALSE)","v":"Osnabrück, Stadt"},{"v":15137,"d":" 15 137"},{"v":14718,"d":" 14 718"},{"v":14631,"d":" 14 631"},{"v":14584,"d":" 14 584"},{"v":14554,"d":" 14 554"},{"v":14707,"d":" 14 707"},{"v":15209,"d":" 15 209"},{"v":15985,"d":" 15 985"},{"v":16602,"d":" 16 602"},{"v":17648,"d":" 17 648"},{"v":19421,"d":" 19 421"},{"v":22855,"d":" 22 855"},{"v":23915,"d":" 23 915"},{"v":24470,"d":" 24 470"},{"v":25290,"d":" 25 290"},9.2,13.9,15.3]
[null,405,{"$f":"VLOOKUP(Tabelle2[[#This Row],[AGS]],AGS_Namen!$C$1:$D$58,2,FALSE)","v":"Wilhelmshaven, Stadt"},{"v":3851,"d":" 3 851"},{"v":3710,"d":" 3 710"},{"v":3676,"d":" 3 676"},{"v":3618,"d":" 3 618"},{"v":3769,"d":" 3 769"},{"v":4274,"d":" 4 274"},{"v":4277,"d":" 4 277"},{"v":4499,"d":" 4 499"},{"v":4440,"d":" 4 440"},{"v":4698,"d":" 4 698"},{"v":5979,"d":" 5 979"},{"v":6925,"d":" 6 925"},{"v":7820,"d":" 7 820"},{"v":8410,"d":" 8 410"},{"v":8785,"d":" 8 785"},4.6,9.1,11.5]
[null,{"v":451,"d":"451.00"},{"$f":"VLOOKUP(Tabelle2[[#This Row],[AGS]],AGS_Namen!$C$1:$D$58,2,FALSE)","v":"Ammerland"},{"v":3288,"d":" 3 288"},{"v":3324,"d":" 3 324"},{"v":3375,"d":" 3 375"},{"v":3362,"d":" 3 362"},{"v":3447,"d":" 3 447"},{"v":3546,"d":" 3 546"},{"v":3749,"d":" 3 749"},{"v":4282,"d":" 4 282"},{"v":4463,"d":" 4 463"},{"v":4953,"d":" 4 953"},{"v":6084,"d":" 6 084"},{"v":7130,"d":" 7 130"},{"v":7600,"d":" 7 600"},{"v":8075,"d":" 8 075"},{"v":8525,"d":" 8 525"},2.8,5.8,6.8]
[null,{"v":452,"d":"452.00"},{"$f":"VLOOKUP(Tabelle2[[#This Row],[AGS]],AGS_Namen!$C$1:$D$58,2,FALSE)","v":"Aurich"},{"v":5338,"d":" 5 338"},{"v":5511,"d":" 5 511"},{"v":5487,"d":" 5 487"},{"v":5158,"d":" 5 158"},{"v":5110,"d":" 5 110"},{"v":5350,"d":" 5 350"},{"v":5469,"d":" 5 469"},{"v":5736,"d":" 5 736"},{"v":6589,"d":" 6 589"},{"v":7903,"d":" 7 903"},{"v":9789,"d":" 9 789"},{"v":11055,"d":" 11 055"},{"v":11200,"d":" 11 200"},{"v":11515,"d":" 11 515"},{"v":11480,"d":" 11 480"},2.8,5.8,6.1]
[null,{"v":453,"d":"453.00"},{"$f":"VLOOKUP(Tabelle2[[#This Row],[AGS]],AGS_Namen!$C$1:$D$58,2,FALSE)","v":"Cloppenburg"},{"v":6341,"d":" 6 341"},{"v":6549,"d":" 6 549"},{"v":6898,"d":" 6 898"},{"v":7296,"d":" 7 296"},{"v":7715,"d":" 7 715"},{"v":8442,"d":" 8 442"},{"v":9052,"d":" 9 052"},{"v":10700,"d":" 10 700"},{"v":11292,"d":" 11 292"},{"v":12969,"d":" 12 969"},{"v":14893,"d":" 14 893"},{"v":17345,"d":" 17 345"},{"v":17050,"d":" 17 050"},{"v":18915,"d":" 18 915"},{"v":18890,"d":" 18 890"},4.1,10.5,11.1]
[null,{"v":454,"d":"454.00"},{"$f":"VLOOKUP(Tabelle2[[#This Row],[AGS]],AGS_Namen!$C$1:$D$58,2,FALSE)","v":"Emsland"},{"v":12579,"d":" 12 579"},{"v":14186,"d":" 14 186"},{"v":15526,"d":" 15 526"},{"v":16357,"d":" 16 357"},{"v":16744,"d":" 16 744"},{"v":17640,"d":" 17 640"},{"v":19224,"d":" 19 224"},{"v":21112,"d":" 21 112"},{"v":22649,"d":" 22 649"},{"v":25259,"d":" 25 259"},{"v":30225,"d":" 30 225"},{"v":34110,"d":" 34 110"},{"v":36430,"d":" 36 430"},{"v":38825,"d":" 38 825"},{"v":40430,"d":" 40 430"},4.1,10.6,12.4]
[null,{"v":455,"d":"455.00"},{"$f":"VLOOKUP(Tabelle2[[#This Row],[AGS]],AGS_Namen!$C$1:$D$58,2,FALSE)","v":"Friesland"},{"v":2756,"d":" 2 756"},{"v":2750,"d":" 2 750"},{"v":2732,"d":" 2 732"},{"v":2655,"d":" 2 655"},{"v":2682,"d":" 2 682"},{"v":2609,"d":" 2 609"},{"v":2735,"d":" 2 735"},{"v":2687,"d":" 2 687"},{"v":2817,"d":" 2 817"},{"v":3078,"d":" 3 078"},{"v":3977,"d":" 3 977"},{"v":4745,"d":" 4 745"},{"v":4770,"d":" 4 770"},{"v":4830,"d":" 4 830"},{"v":4840,"d":" 4 840"},2.7,4.8,4.9]
[null,{"v":456,"d":"456.00"},{"$f":"VLOOKUP(Tabelle2[[#This Row],[AGS]],AGS_Namen!$C$1:$D$58,2,FALSE)","v":"Grafschaft Bentheim"},{"v":13305,"d":" 13 305"},{"v":14052,"d":" 14 052"},{"v":14593,"d":" 14 593"},{"v":15398,"d":" 15 398"},{"v":15678,"d":" 15 678"},{"v":15786,"d":" 15 786"},{"v":16218,"d":" 16 218"},{"v":16768,"d":" 16 768"},{"v":17303,"d":" 17 303"},{"v":18091,"d":" 18 091"},{"v":19829,"d":" 19 829"},{"v":21015,"d":" 21 015"},{"v":21140,"d":" 21 140"},{"v":21550,"d":" 21 550"},{"v":22030,"d":" 22 030"},9.9,15.5,16.1]
[null,{"v":457,"d":"457.00"},{"$f":"VLOOKUP(Tabelle2[[#This Row],[AGS]],AGS_Namen!$C$1:$D$58,2,FALSE)","v":"Leer"},{"v":6519,"d":" 6 519"},{"v":6700,"d":" 6 700"},{"v":7060,"d":" 7 060"},{"v":7139,"d":" 7 139"},{"v":6974,"d":" 6 974"},{"v":7130,"d":" 7 130"},{"v":7472,"d":" 7 472"},{"v":7867,"d":" 7 867"},{"v":8388,"d":" 8 388"},{"v":9314,"d":" 9 314"},{"v":10851,"d":" 10 851"},{"v":12320,"d":" 12 320"},{"v":12705,"d":" 12 705"},{"v":13610,"d":" 13 610"},{"v":14855,"d":" 14 855"},3.9,7.3,8.7]
[null,{"v":458,"d":"458.00"},{"$f":"VLOOKUP(Tabelle2[[#This Row],[AGS]],AGS_Namen!$C$1:$D$58,2,FALSE)","v":"Oldenburg"},{"v":4295,"d":" 4 295"},{"v":4397,"d":" 4 397"},{"v":4428,"d":" 4 428"},{"v":4430,"d":" 4 430"},{"v":4796,"d":" 4 796"},{"v":5240,"d":" 5 240"},{"v":5793,"d":" 5 793"},{"v":6328,"d":" 6 328"},{"v":7080,"d":" 7 080"},{"v":7810,"d":" 7 810"},{"v":9373,"d":" 9 373"},{"v":10860,"d":" 10 860"},{"v":11375,"d":" 11 375"},{"v":11595,"d":" 11 595"},{"v":12525,"d":" 12 525"},3.4,8.4,9.6]
[null,{"v":459,"d":"459.00"},{"$f":"VLOOKUP(Tabelle2[[#This Row],[AGS]],AGS_Namen!$C$1:$D$58,2,FALSE)","v":"Osnabrück"},{"v":16305,"d":" 16 305"},{"v":16323,"d":" 16 323"},{"v":16856,"d":" 16 856"},{"v":17266,"d":" 17 266"},{"v":17369,"d":" 17 369"},{"v":17592,"d":" 17 592"},{"v":18422,"d":" 18 422"},{"v":19312,"d":" 19 312"},{"v":20549,"d":" 20 549"},{"v":22034,"d":" 22 034"},{"v":24667,"d":" 24 667"},{"v":29000,"d":" 29 000"},{"v":30930,"d":" 30 930"},{"v":32625,"d":" 32 625"},{"v":33445,"d":" 33 445"},4.5,8.2,9.3]
[null,{"v":460,"d":"460.00"},{"$f":"VLOOKUP(Tabelle2[[#This Row],[AGS]],AGS_Namen!$C$1:$D$58,2,FALSE)","v":"Vechta"},{"v":8901,"d":" 8 901"},{"v":8932,"d":" 8 932"},{"v":8945,"d":" 8 945"},{"v":9034,"d":" 9 034"},{"v":9364,"d":" 9 364"},{"v":9897,"d":" 9 897"},{"v":10724,"d":" 10 724"},{"v":11183,"d":" 11 183"},{"v":11803,"d":" 11 803"},{"v":13386,"d":" 13 386"},{"v":15697,"d":" 15 697"},{"v":17665,"d":" 17 665"},{"v":18640,"d":" 18 640"},{"v":19790,"d":" 19 790"},{"v":20715,"d":" 20 715"},6.7,12.6,14.5]
[null,{"v":461,"d":"461.00"},{"$f":"VLOOKUP(Tabelle2[[#This Row],[AGS]],AGS_Namen!$C$1:$D$58,2,FALSE)","v":"Wesermarsch"},{"v":5233,"d":" 5 233"},{"v":5295,"d":" 5 295"},{"v":5168,"d":" 5 168"},{"v":5077,"d":" 5 077"},{"v":4960,"d":" 4 960"},{"v":4763,"d":" 4 763"},{"v":4679,"d":" 4 679"},{"v":4669,"d":" 4 669"},{"v":4943,"d":" 4 943"},{"v":5280,"d":" 5 280"},{"v":6429,"d":" 6 429"},{"v":7260,"d":" 7 260"},{"v":7325,"d":" 7 325"},{"v":7455,"d":" 7 455"},{"v":7780,"d":" 7 780"},5.6,8.1,8.8]
[null,{"v":462,"d":"462.00"},{"$f":"VLOOKUP(Tabelle2[[#This Row],[AGS]],AGS_Namen!$C$1:$D$58,2,FALSE)","v":"Wittmund"},{"v":1327,"d":" 1 327"},{"v":1262,"d":" 1 262"},{"v":1242,"d":" 1 242"},{"v":1235,"d":" 1 235"},{"v":1231,"d":" 1 231"},{"v":1306,"d":" 1 306"},{"v":1409,"d":" 1 409"},{"v":1446,"d":" 1 446"},{"v":1651,"d":" 1 651"},{"v":1965,"d":" 1 965"},{"v":2558,"d":" 2 558"},{"v":2560,"d":" 2 560"},{"v":2595,"d":" 2 595"},{"v":2675,"d":" 2 675"},{"v":2745,"d":" 2 745"},2.3,4.5,4.8]
[null,{"v":4,"d":"4.00"},{"$f":"VLOOKUP(Tabelle2[[#This Row],[AGS]],AGS_Namen!$C$1:$D$58,2,FALSE)","v":"Stat. Region Weser-Ems"},{"v":124593,"d":" 124 593"},{"v":126626,"d":" 126 626"},{"v":129389,"d":" 129 389"},{"v":130858,"d":" 130 858"},{"v":132319,"d":" 132 319"},{"v":136335,"d":" 136 335"},{"v":142571,"d":" 142 571"},{"v":152042,"d":" 152 042"},{"v":161729,"d":" 161 729"},{"v":177691,"d":" 177 691"},{"v":207956,"d":" 207 956"},{"v":236470,"d":" 236 470"},{"v":247925,"d":" 247 925"},{"v":260205,"d":" 260 205"},{"v":269505,"d":" 269 505"},{"v":5,"d":"5.0"},9.4,10.6]
[null,{"v":0,"d":"0.00"},{"$f":"VLOOKUP(Tabelle2[[#This Row],[AGS]],AGS_Namen!$C$1:$D$58,2,FALSE)","v":"Niedersachsen"},{"v":461486,"d":" 461 486"},{"v":458757,"d":" 458 757"},{"v":457099,"d":" 457 099"},{"v":453141,"d":" 453 141"},{"v":453636,"d":" 453 636"},{"v":458153,"d":" 458 153"},{"v":470683,"d":" 470 683"},{"v":492072,"d":" 492 072"},{"v":525689,"d":" 525 689"},{"v":570988,"d":" 570 988"},{"v":663817,"d":" 663 817"},{"v":745185,"d":" 745 185"},{"v":776860,"d":" 776 860"},{"v":813080,"d":" 813 080"},{"v":841165,"d":" 841 165"},5.8,9.4,10.5]
[]
[null,null,"1) Anteil der Ausländerinnen und Ausländer laut Ausländerzentralregister an der Bevölkerung laut Fortschreibung. Aufgrund der unterschiedlichen Fortschreibungsbasis für 2005 und 2016 ist die Vergleichbarkeit eingeschränkt."]
[]
[null,null,"Quelle: Ausländerzentralregister, Bevölkerungsfortschreibung"]
[]
[]
[]
[]
[]
[]
[null,null,"Karte A2-2: Anteil der Ausländerinnen und Ausländer 2019 an der Bevölkerung in Prozent"]
{"$rows_empty":39}
[null,null,{"$f":"Def","v":"Die Definition zu dem Indikator sowie methodische Hinweise finden Sie in der Tabelle Aktuelle Ergebnisse"}]
[null,null,{"$f":"Link_LSNOnline","v":"Link zur LSN-Online-Datenbank"}]
[null,null,{"$f":"Link_RegMon","v":"Link zum Regionalmonitoring Niedersachsen"}]

{"sheet":"A3","index":8,"n_rows":114,"n_cols":10,"rows_kept":114,"merged":[[2,2,2,4],[5,2,5,10],[9,2,11,2],[9,3,10,3],[9,4,9,9],[11,4,11,9],[72,2,72,11]]}
[null,null,{"$f":"Kopf","v":"Migration und Teilhabe in Niedersachsen - Integrationsmonitoring 2020 - Regionalinformationen "}]
[]
[]
[]
[null,null,"Indikator A3: Ausländerinnen und Ausländer in Niedersachsen nach Aufenthaltsdauer"]
[null,null,"Tabelle A3-2: Ausländerinnen und Ausländer am 31.12.2019 nach Aufenthaltsdauer und Kreisen"]
[]
[]
[]
[null,null,"Kreisfreie Stadt\nLandkreis\n(Großstadt, Umland)\nStatistische Region\nLand","Ausländerinnen und Ausländer insgesamt","davon mit einer Aufenthaltsdauer von … bis unter … Jahren"]
[{"$nulls":4},"unter 1","1 - 4","4 - 6","6 - 8","8 - 10","10 und mehr"]
[{"$nulls":3},"Anzahl","Prozent"]
[null,"Spalte1","1","2","3","4","5","6","7","8"]
[null,101,{"$f":"VLOOKUP(Datenbereich_A3[[#This Row],[Spalte1]],AGS_Namen!$C$1:$D$58,2,FALSE)","v":"Braunschweig, Stadt"},{"v":31445,"d":" 31 445"},{"v":9.826681507393863,"d":"9.8"},{"v":20.225791063762124,"d":"20.2"},{"v":15.996183813006837,"d":"16.0"},{"v":7.791381777707107,"d":"7.8"},{"v":4.372714262998887,"d":"4.4"},{"v":41.771346795993004,"d":"41.8"}]
[null,102,{"$f":"VLOOKUP(Datenbereich_A3[[#This Row],[Spalte1]],AGS_Namen!$C$1:$D$58,2,FALSE)","v":"Salzgitter, Stadt"},{"v":20175,"d":" 20 175"},{"v":6.5427509293680295,"d":"6.5"},{"v":24.907063197026023,"d":"24.9"},{"v":22.627013630731103,"d":"22.6"},{"v":4.882280049566295,"d":"4.9"},{"v":2.453531598513011,"d":"2.5"},{"v":38.61214374225527,"d":"38.6"}]
[null,103,{"$f":"VLOOKUP(Datenbereich_A3[[#This Row],[Spalte1]],AGS_Namen!$C$1:$D$58,2,FALSE)","v":"Wolfsburg, Stadt"},{"v":20160,"d":" 20 160"},{"v":7.886904761904762,"d":"7.9"},{"v":19.171626984126984,"d":"19.2"},{"v":17.90674603174603,"d":"17.9"},{"v":7.762896825396826,"d":"7.8"},{"v":3.7450396825396823,"d":"3.7"},{"v":43.551587301587304,"d":"43.6"}]
[null,151,{"$f":"VLOOKUP(Datenbereich_A3[[#This Row],[Spalte1]],AGS_Namen!$C$1:$D$58,2,FALSE)","v":"Gifhorn"},{"v":12330,"d":" 12 330"},{"v":5.7583130575831305,"d":"5.8"},{"v":25.42579075425791,"d":"25.4"},{"v":14.152473641524738,"d":"14.2"},{"v":6.204379562043796,"d":"6.2"},{"v":3.5685320356853207,"d":"3.6"},{"v":44.89051094890511,"d":"44.9"}]
[null,153,{"$f":"VLOOKUP(Datenbereich_A3[[#This Row],[Spalte1]],AGS_Namen!$C$1:$D$58,2,FALSE)","v":"Goslar"},{"v":14020,"d":" 14 020"},{"v":12.660485021398001,"d":"12.7"},{"v":28.352353780313837,"d":"28.4"},{"v":18.794579172610558,"d":"18.8"},{"v":5.670470756062768,"d":"5.7"},{"v":2.8887303851640516,"d":"2.9"},{"v":31.633380884450784,"d":"31.6"}]
[null,154,{"$f":"VLOOKUP(Datenbereich_A3[[#This Row],[Spalte1]],AGS_Namen!$C$1:$D$58,2,FALSE)","v":"Helmstedt"},{"v":6535,"d":" 6 535"},{"v":7.345065034429993,"d":"7.3"},{"v":20.657995409334355,"d":"20.7"},{"v":20.88752869166029,"d":"20.9"},{"v":7.345065034429993,"d":"7.3"},{"v":3.2899770466717673,"d":"3.3"},{"v":40.4743687834736,"d":"40.5"}]
[null,155,{"$f":"VLOOKUP(Datenbereich_A3[[#This Row],[Spalte1]],AGS_Namen!$C$1:$D$58,2,FALSE)","v":"Northeim"},{"v":9225,"d":" 9 225"},{"v":6.341463414634147,"d":"6.3"},{"v":22.601626016260163,"d":"22.6"},{"v":21.463414634146343,"d":"21.5"},{"v":6.504065040650407,"d":"6.5"},{"v":3.4688346883468837,"d":"3.5"},{"v":39.56639566395664,"d":"39.6"}]
[null,157,{"$f":"VLOOKUP(Datenbereich_A3[[#This Row],[Spalte1]],AGS_Namen!$C$1:$D$58,2,FALSE)","v":"Peine"},{"v":11340,"d":" 11 340"},{"v":6.834215167548501,"d":"6.8"},{"v":21.781305114638446,"d":"21.8"},{"v":19.797178130511465,"d":"19.8"},{"v":6.3051146384479715,"d":"6.3"},{"v":3.7918871252204585,"d":"3.8"},{"v":41.49029982363316,"d":"41.5"}]
[null,158,{"$f":"VLOOKUP(Datenbereich_A3[[#This Row],[Spalte1]],AGS_Namen!$C$1:$D$58,2,FALSE)","v":"Wolfenbüttel"},{"v":7675,"d":" 7 675"},{"v":5.211726384364821,"d":"5.2"},{"v":22.41042345276873,"d":"22.4"},{"v":21.758957654723126,"d":"21.8"},{"v":6.7752442996742674,"d":"6.8"},{"v":3.3876221498371337,"d":"3.4"},{"v":40.45602605863192,"d":"40.5"}]
[null,159,{"$f":"VLOOKUP(Datenbereich_A3[[#This Row],[Spalte1]],AGS_Namen!$C$1:$D$58,2,FALSE)","v":"Göttingen"},{"v":32090,"d":" 32 090"},{"v":9.130570271112497,"d":"9.1"},{"v":24.914303521346216,"d":"24.9"},{"v":18.15207229666563,"d":"18.2"},{"v":7.011530071673419,"d":"7.0"},{"v":3.365534434403241,"d":"3.4"},{"v":37.441570582736055,"d":"37.4"}]
[null,159016,{"$f":"VLOOKUP(Datenbereich_A3[[#This Row],[Spalte1]],AGS_Namen!$C$1:$D$58,2,FALSE)","v":"   dav. Göttingen, Stadt"},{"v":18815,"d":" 18 815"},{"v":8.530427850119587,"d":"8.5"},{"v":27.55779962795642,"d":"27.6"},{"v":17.99096465585969,"d":"18.0"},{"v":8.184958809460536,"d":"8.2"},{"v":3.6141376561254317,"d":"3.6"},{"v":34.12171140047835,"d":"34.1"}]
[null,159999,{"$f":"VLOOKUP(Datenbereich_A3[[#This Row],[Spalte1]],AGS_Namen!$C$1:$D$58,2,FALSE)","v":"   dav. Göttingen, Umland"},{"v":13275,"d":" 13 275"},{"v":9.981167608286253,"d":"10.0"},{"v":21.167608286252353,"d":"21.2"},{"v":18.380414312617702,"d":"18.4"},{"v":5.348399246704331,"d":"5.3"},{"v":3.0131826741996233,"d":"3.0"},{"v":42.14689265536723,"d":"42.1"}]
[null,1,{"$f":"VLOOKUP(Datenbereich_A3[[#This Row],[Spalte1]],AGS_Namen!$C$1:$D$58,2,FALSE)","v":"Stat. Region Braunschweig"},{"v":165000,"d":" 165 000"},{"v":8.27878787878788,"d":"8.3"},{"v":23.01818181818182,"d":"23.0"},{"v":18.59090909090909,"d":"18.6"},{"v":6.745454545454546,"d":"6.7"},{"v":3.496969696969697,"d":"3.5"},{"v":39.87272727272727,"d":"39.9"}]
[null,241,{"$f":"VLOOKUP(Datenbereich_A3[[#This Row],[Spalte1]],AGS_Namen!$C$1:$D$58,2,FALSE)","v":"Hannover, Region"},{"v":185310,"d":" 185 310"},{"v":4.524850250930872,"d":"4.5"},{"v":19.40801899519724,"d":"19.4"},{"v":17.87275376396309,"d":"17.9"},{"v":7.986617020128434,"d":"8.0"},{"v":4.6516647779396685,"d":"4.7"},{"v":45.556095191840704,"d":"45.6"}]
[null,241001,{"$f":"VLOOKUP(Datenbereich_A3[[#This Row],[Spalte1]],AGS_Namen!$C$1:$D$58,2,FALSE)","v":"   dav. Hannover, Lhst."},{"v":113440,"d":" 113 440"},{"v":4.032968970380818,"d":"4.0"},{"v":18.935119887165023,"d":"18.9"},{"v":16.67842031029619,"d":"16.7"},{"v":8.577221438645982,"d":"8.6"},{"v":5.258286318758816,"d":"5.3"},{"v":46.517983074753175,"d":"46.5"}]
[null,241999,{"$f":"VLOOKUP(Datenbereich_A3[[#This Row],[Spalte1]],AGS_Namen!$C$1:$D$58,2,FALSE)","v":"   dav. Hannover, Umland"},{"v":71870,"d":" 71 870"},{"v":5.3012383470154445,"d":"5.3"},{"v":20.154445526645333,"d":"20.2"},{"v":19.757896201474885,"d":"19.8"},{"v":7.054403784611103,"d":"7.1"},{"v":3.6941700292194244,"d":"3.7"},{"v":44.037846111033815,"d":"44.0"}]
[null,251,{"$f":"VLOOKUP(Datenbereich_A3[[#This Row],[Spalte1]],AGS_Namen!$C$1:$D$58,2,FALSE)","v":"Diepholz"},{"v":18545,"d":" 18 545"},{"v":6.255055270962524,"d":"6.3"},{"v":25.667295767053115,"d":"25.7"},{"v":20.221083850094367,"d":"20.2"},{"v":10.19142626044756,"d":"10.2"},{"v":4.637368562954975,"d":"4.6"},{"v":33.02777028848746,"d":"33.0"}]
[null,252,{"$f":"VLOOKUP(Datenbereich_A3[[#This Row],[Spalte1]],AGS_Namen!$C$1:$D$58,2,FALSE)","v":"Hameln-Pyrmont"},{"v":16910,"d":" 16 910"},{"v":5.381431105854524,"d":"5.4"},{"v":19.574216439976343,"d":"19.6"},{"v":20.934358367829688,"d":"20.9"},{"v":5.7066824364281485,"d":"5.7"},{"v":3.6073329390892965,"d":"3.6"},{"v":44.795978710822,"d":"44.8"}]
[null,254,{"$f":"VLOOKUP(Datenbereich_A3[[#This Row],[Spalte1]],AGS_Namen!$C$1:$D$58,2,FALSE)","v":"Hildesheim"},{"v":24995,"d":" 24 995"},{"v":7.181436287257452,"d":"7.2"},{"v":21.444288857771554,"d":"21.4"},{"v":20.064012802560512,"d":"20.1"},{"v":6.781356271254251,"d":"6.8"},{"v":4.260852170434086,"d":"4.3"},{"v":40.26805361072214,"d":"40.3"}]
[null,254021,{"$f":"VLOOKUP(Datenbereich_A3[[#This Row],[Spalte1]],AGS_Namen!$C$1:$D$58,2,FALSE)","v":"Hildesheim, Stadt"},{"v":14830,"d":" 14 830"},{"v":6.979096426163182,"d":"7.0"},{"v":20.60013486176669,"d":"20.6"},{"v":20.43155765340526,"d":"20.4"},{"v":6.911665542818611,"d":"6.9"},{"v":4.450438300741739,"d":"4.5"},{"v":40.6608226567768,"d":"40.7"}]
[null,254999,{"$f":"VLOOKUP(Datenbereich_A3[[#This Row],[Spalte1]],AGS_Namen!$C$1:$D$58,2,FALSE)","v":"Hildesheim, Umland"},{"v":10165,"d":" 10 165"},{"v":7.476635514018691,"d":"7.5"},{"v":22.67584849975406,"d":"22.7"},{"v":19.527791441219872,"d":"19.5"},{"v":6.591244466305953,"d":"6.6"},{"v":3.984259714707329,"d":"4.0"},{"v":39.6950319724545,"d":"39.7"}]
[null,255,{"$f":"VLOOKUP(Datenbereich_A3[[#This Row],[Spalte1]],AGS_Namen!$C$1:$D$58,2,FALSE)","v":"Holzminden"},{"v":4275,"d":" 4 275"},{"v":4.444444444444445,"d":"4.4"},{"v":19.415204678362574,"d":"19.4"},{"v":20,"d":"20.0"},{"v":3.8596491228070176,"d":"3.9"},{"v":3.3918128654970756,"d":"3.4"},{"v":49.005847953216374,"d":"49.0"}]
[null,256,{"$f":"VLOOKUP(Datenbereich_A3[[#This Row],[Spalte1]],AGS_Namen!$C$1:$D$58,2,FALSE)","v":"Nienburg (Weser)"},{"v":10345,"d":" 10 345"},{"v":7.249879168680522,"d":"7.2"},{"v":23.537941034316095,"d":"23.5"},{"v":24.359594006766557,"d":"24.4"},{"v":6.6698888351860806,"d":"6.7"},{"v":4.0599323344610925,"d":"4.1"},{"v":34.17109714838086,"d":"34.2"}]
[null,257,{"$f":"VLOOKUP(Datenbereich_A3[[#This Row],[Spalte1]],AGS_Namen!$C$1:$D$58,2,FALSE)","v":"Schaumburg"},{"v":14255,"d":" 14 255"},{"v":5.787443002455279,"d":"5.8"},{"v":23.18484742195721,"d":"23.2"},{"v":18.835496317081727,"d":"18.8"},{"v":5.436688881094353,"d":"5.4"},{"v":3.402314977200982,"d":"3.4"},{"v":43.38828481234655,"d":"43.4"}]
[null,2,{"$f":"VLOOKUP(Datenbereich_A3[[#This Row],[Spalte1]],AGS_Namen!$C$1:$D$58,2,FALSE)","v":"Stat. Region Hannover"},{"v":274635,"d":" 274 635"},{"v":5.101316292533727,"d":"5.1"},{"v":20.37795619640614,"d":"20.4"},{"v":18.74487956742586,"d":"18.7"},{"v":7.639230251060498,"d":"7.6"},{"v":4.444080324794728,"d":"4.4"},{"v":43.69253736777905,"d":"43.7"}]
[null,351,{"$f":"VLOOKUP(Datenbereich_A3[[#This Row],[Spalte1]],AGS_Namen!$C$1:$D$58,2,FALSE)","v":"Celle"},{"v":14330,"d":" 14 330"},{"v":7.292393579902303,"d":"7.3"},{"v":22.64480111653873,"d":"22.6"},{"v":23.30774598743894,"d":"23.3"},{"v":6.94347522679693,"d":"6.9"},{"v":3.6636427076064204,"d":"3.7"},{"v":36.14794138171668,"d":"36.1"}]
[null,352,{"$f":"VLOOKUP(Datenbereich_A3[[#This Row],[Spalte1]],AGS_Namen!$C$1:$D$58,2,FALSE)","v":"Cuxhaven"},{"v":13345,"d":" 13 345"},{"v":5.957287373548145,"d":"6.0"},{"v":20.157362307980517,"d":"20.2"},{"v":20.044960659423005,"d":"20.0"},{"v":6.819033345822405,"d":"6.8"},{"v":3.821656050955414,"d":"3.8"},{"v":43.19970026227051,"d":"43.2"}]
[null,353,{"$f":"VLOOKUP(Datenbereich_A3[[#This Row],[Spalte1]],AGS_Namen!$C$1:$D$58,2,FALSE)","v":"Harburg"},{"v":21285,"d":" 21 285"},{"v":9.466760629551327,"d":"9.5"},{"v":20.17852948085506,"d":"20.2"},{"v":17.594550152689685,"d":"17.6"},{"v":6.6713648108996955,"d":"6.7"},{"v":4.651162790697675,"d":"4.7"},{"v":41.41414141414141,"d":"41.4"}]
[null,354,{"$f":"VLOOKUP(Datenbereich_A3[[#This Row],[Spalte1]],AGS_Namen!$C$1:$D$58,2,FALSE)","v":"Lüchow-Dannenberg"},{"v":2785,"d":" 2 785"},{"v":9.515260323159785,"d":"9.5"},{"v":21.723518850987432,"d":"21.7"},{"v":25.134649910233392,"d":"25.1"},{"v":8.976660682226212,"d":"9.0"},{"v":3.4111310592459607,"d":"3.4"},{"v":31.41831238779174,"d":"31.4"}]
[null,355,{"$f":"VLOOKUP(Datenbereich_A3[[#This Row],[Spalte1]],AGS_Namen!$C$1:$D$58,2,FALSE)","v":"Lüneburg"},{"v":13120,"d":" 13 120"},{"v":7.317073170731707,"d":"7.3"},{"v":23.47560975609756,"d":"23.5"},{"v":25.495426829268293,"d":"25.5"},{"v":7.393292682926829,"d":"7.4"},{"v":3.6585365853658534,"d":"3.7"},{"v":32.66006097560975,"d":"32.7"}]
[null,356,{"$f":"VLOOKUP(Datenbereich_A3[[#This Row],[Spalte1]],AGS_Namen!$C$1:$D$58,2,FALSE)","v":"Osterholz"},{"v":6715,"d":" 6 715"},{"v":5.658972449739389,"d":"5.7"},{"v":17.27475800446761,"d":"17.3"},{"v":22.710349962769918,"d":"22.7"},{"v":6.701414743112435,"d":"6.7"},{"v":4.095309009679822,"d":"4.1"},{"v":43.55919583023083,"d":"43.6"}]
[null,357,{"$f":"VLOOKUP(Datenbereich_A3[[#This Row],[Spalte1]],AGS_Namen!$C$1:$D$58,2,FALSE)","v":"Rotenburg (Wümme)"},{"v":11585,"d":" 11 585"},{"v":8.890807078118257,"d":"8.9"},{"v":22.658610271903324,"d":"22.7"},{"v":20.241691842900302,"d":"20.2"},{"v":6.732844195079844,"d":"6.7"},{"v":3.711696158826068,"d":"3.7"},{"v":37.807509710832974,"d":"37.8"}]
[null,358,{"$f":"VLOOKUP(Datenbereich_A3[[#This Row],[Spalte1]],AGS_Namen!$C$1:$D$58,2,FALSE)","v":"Heidekreis"},{"v":12525,"d":" 12 525"},{"v":10.778443113772456,"d":"10.8"},{"v":23.512974051896208,"d":"23.5"},{"v":18.882235528942115,"d":"18.9"},{"v":7.824351297405189,"d":"7.8"},{"v":4.750499001996008,"d":"4.8"},{"v":34.21157684630739,"d":"34.2"}]
[null,359,{"$f":"VLOOKUP(Datenbereich_A3[[#This Row],[Spalte1]],AGS_Namen!$C$1:$D$58,2,FALSE)","v":"Stade"},{"v":19385,"d":" 19 385"},{"v":8.331183905081248,"d":"8.3"},{"v":25.664173329894247,"d":"25.7"},{"v":22.775341759092083,"d":"22.8"},{"v":7.5058034562806295,"d":"7.5"},{"v":4.874903275728657,"d":"4.9"},{"v":30.874387412948156,"d":"30.9"}]
[null,360,{"$f":"VLOOKUP(Datenbereich_A3[[#This Row],[Spalte1]],AGS_Namen!$C$1:$D$58,2,FALSE)","v":"Uelzen"},{"v":5765,"d":" 5 765"},{"v":8.49956634865568,"d":"8.5"},{"v":22.63660017346054,"d":"22.6"},{"v":24.978317432784042,"d":"25.0"},{"v":7.632263660017347,"d":"7.6"},{"v":3.98959236773634,"d":"4.0"},{"v":32.263660017346055,"d":"32.3"}]
[null,361,{"$f":"VLOOKUP(Datenbereich_A3[[#This Row],[Spalte1]],AGS_Namen!$C$1:$D$58,2,FALSE)","v":"Verden"},{"v":11175,"d":" 11 175"},{"v":6.263982102908278,"d":"6.3"},{"v":20.22371364653244,"d":"20.2"},{"v":21.476510067114095,"d":"21.5"},{"v":6.0402684563758395,"d":"6.0"},{"v":3.7583892617449663,"d":"3.8"},{"v":42.23713646532439,"d":"42.2"}]
[null,3,{"$f":"VLOOKUP(Datenbereich_A3[[#This Row],[Spalte1]],AGS_Namen!$C$1:$D$58,2,FALSE)","v":"Stat. Region Lüneburg"},{"v":132025,"d":" 132 025"},{"v":8.070441204317364,"d":"8.1"},{"v":22.105661806476046,"d":"22.1"},{"v":21.431547055481918,"d":"21.4"},{"v":7.059269077826169,"d":"7.1"},{"v":4.162090513160386,"d":"4.2"},{"v":37.17099034273812,"d":"37.2"}]
[null,401,{"$f":"VLOOKUP(Datenbereich_A3[[#This Row],[Spalte1]],AGS_Namen!$C$1:$D$58,2,FALSE)","v":"Delmenhorst, Stadt"},{"v":13220,"d":" 13 220"},{"v":5.332829046898638,"d":"5.3"},{"v":25.03782148260212,"d":"25.0"},{"v":22.617246596066565,"d":"22.6"},{"v":6.959152798789712,"d":"7.0"},{"v":4.009077155824508,"d":"4.0"},{"v":36.00605143721634,"d":"36.0"}]
[null,402,{"$f":"VLOOKUP(Datenbereich_A3[[#This Row],[Spalte1]],AGS_Namen!$C$1:$D$58,2,FALSE)","v":"Emden, Stadt"},{"v":5675,"d":" 5 675"},{"v":8.28193832599119,"d":"8.3"},{"v":26.607929515418505,"d":"26.6"},{"v":26.079295154185022,"d":"26.1"},{"v":10.484581497797357,"d":"10.5"},{"v":3.6123348017621146,"d":"3.6"},{"v":24.933920704845818,"d":"24.9"}]
[null,403,{"$f":"VLOOKUP(Datenbereich_A3[[#This Row],[Spalte1]],AGS_Namen!$C$1:$D$58,2,FALSE)","v":"Oldenburg (Oldb), Stadt"},{"v":18285,"d":" 18 285"},{"v":8.531583264971287,"d":"8.5"},{"v":25.676784249384742,"d":"25.7"},{"v":22.996992070002733,"d":"23.0"},{"v":7.71123872026251,"d":"7.7"},{"v":4.3478260869565215,"d":"4.3"},{"v":30.735575608422206,"d":"30.7"}]
[null,404,{"$f":"VLOOKUP(Datenbereich_A3[[#This Row],[Spalte1]],AGS_Namen!$C$1:$D$58,2,FALSE)","v":"Osnabrück, Stadt"},{"v":25290,"d":" 25 290"},{"v":8.540925266903916,"d":"8.5"},{"v":22.81534203242388,"d":"22.8"},{"v":18.94029260577303,"d":"18.9"},{"v":7.018584420719652,"d":"7.0"},{"v":4.112297350731514,"d":"4.1"},{"v":38.55278766310795,"d":"38.6"}]
[null,405,{"$f":"VLOOKUP(Datenbereich_A3[[#This Row],[Spalte1]],AGS_Namen!$C$1:$D$58,2,FALSE)","v":"Wilhelmshaven, Stadt"},{"v":8785,"d":" 8 785"},{"v":8.992601024473535,"d":"9.0"},{"v":27.376209447922594,"d":"27.4"},{"v":29.368241320432553,"d":"29.4"},{"v":6.20375640295959,"d":"6.2"},{"v":2.788844621513944,"d":"2.8"},{"v":25.270347182697776,"d":"25.3"}]
[null,451,{"$f":"VLOOKUP(Datenbereich_A3[[#This Row],[Spalte1]],AGS_Namen!$C$1:$D$58,2,FALSE)","v":"Ammerland"},{"v":8525,"d":" 8 525"},{"v":8.680351906158359,"d":"8.7"},{"v":25.86510263929619,"d":"25.9"},{"v":23.870967741935484,"d":"23.9"},{"v":8.328445747800586,"d":"8.3"},{"v":5.043988269794721,"d":"5.0"},{"v":28.152492668621704,"d":"28.2"}]
[null,452,{"$f":"VLOOKUP(Datenbereich_A3[[#This Row],[Spalte1]],AGS_Namen!$C$1:$D$58,2,FALSE)","v":"Aurich"},{"v":11480,"d":" 11 480"},{"v":9.015679442508711,"d":"9.0"},{"v":26.132404181184672,"d":"26.1"},{"v":22.60452961672474,"d":"22.6"},{"v":8.275261324041812,"d":"8.3"},{"v":4.311846689895471,"d":"4.3"},{"v":29.61672473867596,"d":"29.6"}]
[null,453,{"$f":"VLOOKUP(Datenbereich_A3[[#This Row],[Spalte1]],AGS_Namen!$C$1:$D$58,2,FALSE)","v":"Cloppenburg"},{"v":18890,"d":" 18 890"},{"v":6.458443620963472,"d":"6.5"},{"v":29.77766013763896,"d":"29.8"},{"v":20.963472736897828,"d":"21.0"},{"v":9.76707252514558,"d":"9.8"},{"v":6.617257808364214,"d":"6.6"},{"v":26.389624139756485,"d":"26.4"}]
[null,454,{"$f":"VLOOKUP(Datenbereich_A3[[#This Row],[Spalte1]],AGS_Namen!$C$1:$D$58,2,FALSE)","v":"Emsland"},{"v":40430,"d":" 40 430"},{"v":12.020776651001732,"d":"12.0"},{"v":28.060845906505072,"d":"28.1"},{"v":18.315607222359635,"d":"18.3"},{"v":8.459065050704922,"d":"8.5"},{"v":5.416769725451397,"d":"5.4"},{"v":27.73930249814494,"d":"27.7"}]
[null,455,{"$f":"VLOOKUP(Datenbereich_A3[[#This Row],[Spalte1]],AGS_Namen!$C$1:$D$58,2,FALSE)","v":"Friesland"},{"v":4840,"d":" 4 840"},{"v":6.198347107438017,"d":"6.2"},{"v":19.731404958677686,"d":"19.7"},{"v":27.16942148760331,"d":"27.2"},{"v":7.747933884297521,"d":"7.7"},{"v":3.4090909090909087,"d":"3.4"},{"v":35.74380165289256,"d":"35.7"}]
[null,456,{"$f":"VLOOKUP(Datenbereich_A3[[#This Row],[Spalte1]],AGS_Namen!$C$1:$D$58,2,FALSE)","v":"Grafschaft Bentheim"},{"v":22030,"d":" 22 030"},{"v":4.561960962324103,"d":"4.6"},{"v":17.79391738538357,"d":"17.8"},{"v":14.480254198819791,"d":"14.5"},{"v":8.034498411257376,"d":"8.0"},{"v":5.696777122106219,"d":"5.7"},{"v":49.45528824330459,"d":"49.5"}]
[null,457,{"$f":"VLOOKUP(Datenbereich_A3[[#This Row],[Spalte1]],AGS_Namen!$C$1:$D$58,2,FALSE)","v":"Leer"},{"v":14855,"d":" 14 855"},{"v":10.097610232245035,"d":"10.1"},{"v":24.907438572871087,"d":"24.9"},{"v":20.733759676876474,"d":"20.7"},{"v":7.539548973409627,"d":"7.5"},{"v":4.981487714574218,"d":"5.0"},{"v":31.74015483002356,"d":"31.7"}]
[null,458,{"$f":"VLOOKUP(Datenbereich_A3[[#This Row],[Spalte1]],AGS_Namen!$C$1:$D$58,2,FALSE)","v":"Oldenburg"},{"v":12525,"d":" 12 525"},{"v":11.29740518962076,"d":"11.3"},{"v":29.221556886227546,"d":"29.2"},{"v":20.758483033932134,"d":"20.8"},{"v":8.622754491017965,"d":"8.6"},{"v":4.910179640718563,"d":"4.9"},{"v":25.189620758483034,"d":"25.2"}]
[null,459,{"$f":"VLOOKUP(Datenbereich_A3[[#This Row],[Spalte1]],AGS_Namen!$C$1:$D$58,2,FALSE)","v":"Osnabrück"},{"v":33445,"d":" 33 445"},{"v":9.657646882942144,"d":"9.7"},{"v":25.205561369412465,"d":"25.2"},{"v":15.159216624308566,"d":"15.2"},{"v":7.5646583943788315,"d":"7.6"},{"v":4.544775003737479,"d":"4.5"},{"v":37.85319180744506,"d":"37.9"}]
[null,460,{"$f":"VLOOKUP(Datenbereich_A3[[#This Row],[Spalte1]],AGS_Namen!$C$1:$D$58,2,FALSE)","v":"Vechta"},{"v":20715,"d":" 20 715"},{"v":9.582428192131307,"d":"9.6"},{"v":24.40260680666184,"d":"24.4"},{"v":20.468259715182235,"d":"20.5"},{"v":9.09968621771663,"d":"9.1"},{"v":5.817040791696838,"d":"5.8"},{"v":30.581704079169686,"d":"30.6"}]
[null,461,{"$f":"VLOOKUP(Datenbereich_A3[[#This Row],[Spalte1]],AGS_Namen!$C$1:$D$58,2,FALSE)","v":"Wesermarsch"},{"v":7780,"d":" 7 780"},{"v":6.876606683804627,"d":"6.9"},{"v":22.10796915167095,"d":"22.1"},{"v":20.822622107969153,"d":"20.8"},{"v":5.848329048843188,"d":"5.8"},{"v":3.470437017994859,"d":"3.5"},{"v":40.80976863753214,"d":"40.8"}]
[null,462,{"$f":"VLOOKUP(Datenbereich_A3[[#This Row],[Spalte1]],AGS_Namen!$C$1:$D$58,2,FALSE)","v":"Wittmund"},{"v":2745,"d":" 2 745"},{"v":9.65391621129326,"d":"9.7"},{"v":25.318761384335154,"d":"25.3"},{"v":22.768670309653917,"d":"22.8"},{"v":6.9216757741347905,"d":"6.9"},{"v":4.371584699453552,"d":"4.4"},{"v":30.965391621129324,"d":"31.0"}]
[null,4,{"$f":"VLOOKUP(Datenbereich_A3[[#This Row],[Spalte1]],AGS_Namen!$C$1:$D$58,2,FALSE)","v":"Stat. Region Weser-Ems"},{"v":269505,"d":" 269 505"},{"v":8.823583978033803,"d":"8.8"},{"v":25.23700858982208,"d":"25.2"},{"v":19.95695812693642,"d":"20.0"},{"v":8.007272592345226,"d":"8.0"},{"v":4.847776479100573,"d":"4.8"},{"v":33.12925548691119,"d":"33.1"}]
[null,0,{"$f":"VLOOKUP(Datenbereich_A3[[#This Row],[Spalte1]],AGS_Namen!$C$1:$D$58,2,FALSE)","v":"Niedersachsen"},{"v":841165,"d":" 841 165"},{"v":7.382618154583227,"d":"7.4"},{"v":22.723841339095184,"d":"22.7"},{"v":19.524112391742403,"d":"19.5"},{"v":7.490801447991774,"d":"7.5"},{"v":4.3427864925430795,"d":"4.3"},{"v":38.53524576034428,"d":"38.5"}]
[]
[null,null,"Quelle: Ausländerzentralregister"]
[]
[null,null,"Karte A3-2: Anteil der Ausländerinnen und Ausländer am 31.12.2019 mit einer Aufenthaltsdauer von 10 Jahren und mehr an allen Ausländerinnen und Ausländern in Prozent"]
{"$rows_empty":39}
[null,null,{"$f":"Def","v":"Die Definition zu dem Indikator sowie methodische Hinweise finden Sie in der Tabelle Aktuelle Ergebnisse"}]
[null,null,{"$f":"Link_LSNOnline","v":"Link zur LSN-Online-Datenbank"}]

{"sheet":"A4","index":9,"n_rows":126,"n_cols":13,"rows_kept":126,"merged":[[2,2,2,4],[8,2,10,2],[8,3,8,12],[9,3,9,7],[9,8,9,12],[71,2,71,11]]}
[null,null,{"$f":"Kopf","v":"Migration und Teilhabe in Niedersachsen - Integrationsmonitoring 2020 - Regionalinformationen "}]
[]
[]
[]
[null,null,"Indikator A4: Ausländerinnen und Ausländer nach ausgewählten Staatsangehörigkeiten"]
[null,null,"Tabelle A4-2: Ausländerinnen und Ausländer 2005 und 2019 (31.12.) nach ausgewählten Staatsangehörigkeiten und Kreisen"]
[]
[]
[null,null,"Kreisfreie Stadt\nLandkreis\n(Großstadt, Umland)\nStatistische Region\nLand","Ausländerinnen und Ausländer mit der Staatsangehörigkeit"]
[{"$nulls":3},2005,{"$nulls":4},2019]
[{"$nulls":3},"Polen","Türkei","Syrien","Rumänien","Irak","Polen","Türkei","Syrien","Rumänien","Irak"]
[]
[null,"Spalte1","1","2","3","4","5","6","7","8","9","10","11"]
[null,101,{"$f":"VLOOKUP(Tabelle4[[#This Row],[Spalte1]],AGS_Namen!$C$1:$D$58,2,FALSE)","v":"Braunschweig, Stadt"},{"v":1942,"d":" 1 942"},{"v":5957,"d":" 5 957"},{"v":183,"d":"  183"},{"v":238,"d":"  238"},{"v":212,"d":"  212"},{"v":3635,"d":" 3 635"},{"v":5115,"d":" 5 115"},{"v":2645,"d":" 2 645"},{"v":610,"d":"  610"},{"v":670,"d":"  670"}]
[null,102,{"$f":"VLOOKUP(Tabelle4[[#This Row],[Spalte1]],AGS_Namen!$C$1:$D$58,2,FALSE)","v":"Salzgitter, Stadt"},{"v":543,"d":"  543"},{"v":6320,"d":" 6 320"},{"v":46,"d":"  46"},{"v":120,"d":"  120"},{"v":103,"d":"  103"},{"v":1680,"d":" 1 680"},{"v":5095,"d":" 5 095"},{"v":4325,"d":" 4 325"},{"v":1635,"d":" 1 635"},{"v":305,"d":"  305"}]
[null,103,{"$f":"VLOOKUP(Tabelle4[[#This Row],[Spalte1]],AGS_Namen!$C$1:$D$58,2,FALSE)","v":"Wolfsburg, Stadt"},{"v":596,"d":"  596"},{"v":581,"d":"  581"},{"v":112,"d":"  112"},{"v":78,"d":"  78"},{"v":181,"d":"  181"},{"v":1330,"d":" 1 330"},{"v":700,"d":"  700"},{"v":1625,"d":" 1 625"},{"v":485,"d":"  485"},{"v":540,"d":"  540"}]
[null,151,{"$f":"VLOOKUP(Tabelle4[[#This Row],[Spalte1]],AGS_Namen!$C$1:$D$58,2,FALSE)","v":"Gifhorn"},{"v":523,"d":"  523"},{"v":1903,"d":" 1 903"},{"v":61,"d":"  61"},{"v":54,"d":"  54"},{"v":100,"d":"  100"},{"v":1050,"d":" 1 050"},{"v":1655,"d":" 1 655"},{"v":875,"d":"  875"},{"v":625,"d":"  625"},{"v":455,"d":"  455"}]
[null,153,{"$f":"VLOOKUP(Tabelle4[[#This Row],[Spalte1]],AGS_Namen!$C$1:$D$58,2,FALSE)","v":"Goslar"},{"v":430,"d":"  430"},{"v":1936,"d":" 1 936"},{"v":58,"d":"  58"},{"v":46,"d":"  46"},{"v":38,"d":"  38"},{"v":875,"d":"  875"},{"v":1450,"d":" 1 450"},{"v":1570,"d":" 1 570"},{"v":480,"d":"  480"},{"v":360,"d":"  360"}]
[null,154,{"$f":"VLOOKUP(Tabelle4[[#This Row],[Spalte1]],AGS_Namen!$C$1:$D$58,2,FALSE)","v":"Helmstedt"},{"v":316,"d":"  316"},{"v":1146,"d":" 1 146"},{"v":26,"d":"  26"},{"v":18,"d":"  18"},{"v":125,"d":"  125"},{"v":860,"d":"  860"},{"v":865,"d":"  865"},{"v":445,"d":"  445"},{"v":315,"d":"  315"},{"v":390,"d":"  390"}]
[null,155,{"$f":"VLOOKUP(Tabelle4[[#This Row],[Spalte1]],AGS_Namen!$C$1:$D$58,2,FALSE)","v":"Northeim"},{"v":336,"d":"  336"},{"v":1026,"d":" 1 026"},{"v":99,"d":"  99"},{"v":39,"d":"  39"},{"v":43,"d":"  43"},{"v":895,"d":"  895"},{"v":690,"d":"  690"},{"v":1065,"d":" 1 065"},{"v":495,"d":"  495"},{"v":465,"d":"  465"}]
[null,157,{"$f":"VLOOKUP(Tabelle4[[#This Row],[Spalte1]],AGS_Namen!$C$1:$D$58,2,FALSE)","v":"Peine"},{"v":478,"d":"  478"},{"v":2946,"d":" 2 946"},{"v":101,"d":"  101"},{"v":32,"d":"  32"},{"v":70,"d":"  70"},{"v":1450,"d":" 1 450"},{"v":2245,"d":" 2 245"},{"v":1585,"d":" 1 585"},{"v":520,"d":"  520"},{"v":620,"d":"  620"}]
[null,158,{"$f":"VLOOKUP(Tabelle4[[#This Row],[Spalte1]],AGS_Namen!$C$1:$D$58,2,FALSE)","v":"Wolfenbüttel"},{"v":326,"d":"  326"},{"v":1325,"d":" 1 325"},{"v":161,"d":"  161"},{"v":24,"d":"  24"},{"v":57,"d":"  57"},{"v":750,"d":"  750"},{"v":915,"d":"  915"},{"v":1050,"d":" 1 050"},{"v":125,"d":"  125"},{"v":250,"d":"  250"}]
[null,159,{"$f":"VLOOKUP(Tabelle4[[#This Row],[Spalte1]],AGS_Namen!$C$1:$D$58,2,FALSE)","v":"Göttingen"},{"v":989,"d":"  989"},{"v":3823,"d":" 3 823"},{"v":181,"d":"  181"},{"v":159,"d":"  159"},{"v":334,"d":"  334"},{"v":1545,"d":" 1 545"},{"v":3000,"d":" 3 000"},{"v":2860,"d":" 2 860"},{"v":1135,"d":" 1 135"},{"v":815,"d":"  815"}]
[null,1,{"$f":"VLOOKUP(Tabelle4[[#This Row],[Spalte1]],AGS_Namen!$C$1:$D$58,2,FALSE)","v":"Stat. Region Braunschweig"},{"v":6479,"d":" 6 479"},{"v":26963,"d":" 26 963"},{"v":1028,"d":" 1 028"},{"v":808,"d":"  808"},{"v":1263,"d":" 1 263"},{"v":14065,"d":" 14 065"},{"v":21725,"d":" 21 725"},{"v":18045,"d":" 18 045"},{"v":6430,"d":" 6 430"},{"v":4860,"d":" 4 860"}]
[null,241,{"$f":"VLOOKUP(Tabelle4[[#This Row],[Spalte1]],AGS_Namen!$C$1:$D$58,2,FALSE)","v":"Hannover, Region"},{"v":7889,"d":" 7 889"},{"v":29699,"d":" 29 699"},{"v":978,"d":"  978"},{"v":732,"d":"  732"},{"v":2607,"d":" 2 607"},{"v":18065,"d":" 18 065"},{"v":25830,"d":" 25 830"},{"v":14770,"d":" 14 770"},{"v":6870,"d":" 6 870"},{"v":11295,"d":" 11 295"}]
[null,241001,{"$f":"VLOOKUP(Tabelle4[[#This Row],[Spalte1]],AGS_Namen!$C$1:$D$58,2,FALSE)","v":"   dav. Hannover, Lhst."},{"v":4696,"d":" 4 696"},{"v":19350,"d":" 19 350"},{"v":516,"d":"  516"},{"v":335,"d":"  335"},{"v":1993,"d":" 1 993"},{"v":9470,"d":" 9 470"},{"v":16275,"d":" 16 275"},{"v":6715,"d":" 6 715"},{"v":3715,"d":" 3 715"},{"v":5320,"d":" 5 320"}]
[null,241999,{"$f":"VLOOKUP(Tabelle4[[#This Row],[Spalte1]],AGS_Namen!$C$1:$D$58,2,FALSE)","v":"   dav. Hannover, Umland"},{"v":3193,"d":" 3 193"},{"v":10349,"d":" 10 349"},{"v":462,"d":"  462"},{"v":397,"d":"  397"},{"v":614,"d":"  614"},{"v":8595,"d":" 8 595"},{"v":9555,"d":" 9 555"},{"v":8055,"d":" 8 055"},{"v":3155,"d":" 3 155"},{"v":5975,"d":" 5 975"}]
[null,251,{"$f":"VLOOKUP(Tabelle4[[#This Row],[Spalte1]],AGS_Namen!$C$1:$D$58,2,FALSE)","v":"Diepholz"},{"v":754,"d":"  754"},{"v":1788,"d":" 1 788"},{"v":121,"d":"  121"},{"v":59,"d":"  59"},{"v":94,"d":"  94"},{"v":3430,"d":" 3 430"},{"v":1540,"d":" 1 540"},{"v":1805,"d":" 1 805"},{"v":1780,"d":" 1 780"},{"v":895,"d":"  895"}]
[null,252,{"$f":"VLOOKUP(Tabelle4[[#This Row],[Spalte1]],AGS_Namen!$C$1:$D$58,2,FALSE)","v":"Hameln-Pyrmont"},{"v":568,"d":"  568"},{"v":3221,"d":" 3 221"},{"v":142,"d":"  142"},{"v":55,"d":"  55"},{"v":46,"d":"  46"},{"v":1050,"d":" 1 050"},{"v":2670,"d":" 2 670"},{"v":2170,"d":" 2 170"},{"v":1295,"d":" 1 295"},{"v":1155,"d":" 1 155"}]
[null,254,{"$f":"VLOOKUP(Tabelle4[[#This Row],[Spalte1]],AGS_Namen!$C$1:$D$58,2,FALSE)","v":"Hildesheim"},{"v":979,"d":"  979"},{"v":4163,"d":" 4 163"},{"v":292,"d":"  292"},{"v":130,"d":"  130"},{"v":215,"d":"  215"},{"v":2320,"d":" 2 320"},{"v":3235,"d":" 3 235"},{"v":2640,"d":" 2 640"},{"v":1220,"d":" 1 220"},{"v":1740,"d":" 1 740"}]
[null,255,{"$f":"VLOOKUP(Tabelle4[[#This Row],[Spalte1]],AGS_Namen!$C$1:$D$58,2,FALSE)","v":"Holzminden"},{"v":179,"d":"  179"},{"v":1355,"d":" 1 355"},{"v":26,"d":"  26"},{"v":14,"d":"  14"},{"v":13,"d":"  13"},{"v":155,"d":"  155"},{"v":965,"d":"  965"},{"v":640,"d":"  640"},{"v":65,"d":"  65"},{"v":150,"d":"  150"}]
[null,256,{"$f":"VLOOKUP(Tabelle4[[#This Row],[Spalte1]],AGS_Namen!$C$1:$D$58,2,FALSE)","v":"Nienburg (Weser)"},{"v":482,"d":"  482"},{"v":1984,"d":" 1 984"},{"v":331,"d":"  331"},{"v":33,"d":"  33"},{"v":58,"d":"  58"},{"v":1670,"d":" 1 670"},{"v":1315,"d":" 1 315"},{"v":1375,"d":" 1 375"},{"v":1180,"d":" 1 180"},{"v":1055,"d":" 1 055"}]
[null,257,{"$f":"VLOOKUP(Tabelle4[[#This Row],[Spalte1]],AGS_Namen!$C$1:$D$58,2,FALSE)","v":"Schaumburg"},{"v":599,"d":"  599"},{"v":3060,"d":" 3 060"},{"v":153,"d":"  153"},{"v":59,"d":"  59"},{"v":145,"d":"  145"},{"v":1730,"d":" 1 730"},{"v":2085,"d":" 2 085"},{"v":1550,"d":" 1 550"},{"v":625,"d":"  625"},{"v":810,"d":"  810"}]
[null,2,{"$f":"VLOOKUP(Tabelle4[[#This Row],[Spalte1]],AGS_Namen!$C$1:$D$58,2,FALSE)","v":"Stat. Region Hannover"},{"v":11450,"d":" 11 450"},{"v":45270,"d":" 45 270"},{"v":2043,"d":" 2 043"},{"v":1082,"d":" 1 082"},{"v":3178,"d":" 3 178"},{"v":28425,"d":" 28 425"},{"v":37635,"d":" 37 635"},{"v":24950,"d":" 24 950"},{"v":13035,"d":" 13 035"},{"v":17105,"d":" 17 105"}]
[null,351,{"$f":"VLOOKUP(Tabelle4[[#This Row],[Spalte1]],AGS_Namen!$C$1:$D$58,2,FALSE)","v":"Celle"},{"v":421,"d":"  421"},{"v":2418,"d":" 2 418"},{"v":121,"d":"  121"},{"v":75,"d":"  75"},{"v":150,"d":"  150"},{"v":1595,"d":" 1 595"},{"v":1370,"d":" 1 370"},{"v":1660,"d":" 1 660"},{"v":915,"d":"  915"},{"v":1930,"d":" 1 930"}]
[null,352,{"$f":"VLOOKUP(Tabelle4[[#This Row],[Spalte1]],AGS_Namen!$C$1:$D$58,2,FALSE)","v":"Cuxhaven"},{"v":426,"d":"  426"},{"v":1151,"d":" 1 151"},{"v":87,"d":"  87"},{"v":39,"d":"  39"},{"v":79,"d":"  79"},{"v":1450,"d":" 1 450"},{"v":790,"d":"  790"},{"v":1580,"d":" 1 580"},{"v":580,"d":"  580"},{"v":365,"d":"  365"}]
[null,353,{"$f":"VLOOKUP(Tabelle4[[#This Row],[Spalte1]],AGS_Namen!$C$1:$D$58,2,FALSE)","v":"Harburg"},{"v":878,"d":"  878"},{"v":1619,"d":" 1 619"},{"v":96,"d":"  96"},{"v":126,"d":"  126"},{"v":58,"d":"  58"},{"v":3105,"d":" 3 105"},{"v":1565,"d":" 1 565"},{"v":1190,"d":" 1 190"},{"v":1640,"d":" 1 640"},{"v":425,"d":"  425"}]
[null,354,{"$f":"VLOOKUP(Tabelle4[[#This Row],[Spalte1]],AGS_Namen!$C$1:$D$58,2,FALSE)","v":"Lüchow-Dannenberg"},{"v":235,"d":"  235"},{"v":104,"d":"  104"},{"v":7,"d":"  7"},{"v":8,"d":"  8"},{"v":1,"d":"  1"},{"v":645,"d":"  645"},{"v":110,"d":"  110"},{"v":275,"d":"  275"},{"v":135,"d":"  135"},{"v":55,"d":"  55"}]
[null,355,{"$f":"VLOOKUP(Tabelle4[[#This Row],[Spalte1]],AGS_Namen!$C$1:$D$58,2,FALSE)","v":"Lüneburg"},{"v":585,"d":"  585"},{"v":995,"d":"  995"},{"v":117,"d":"  117"},{"v":37,"d":"  37"},{"v":157,"d":"  157"},{"v":1465,"d":" 1 465"},{"v":775,"d":"  775"},{"v":1910,"d":" 1 910"},{"v":555,"d":"  555"},{"v":795,"d":"  795"}]
[null,356,{"$f":"VLOOKUP(Tabelle4[[#This Row],[Spalte1]],AGS_Namen!$C$1:$D$58,2,FALSE)","v":"Osterholz"},{"v":263,"d":"  263"},{"v":1008,"d":" 1 008"},{"v":83,"d":"  83"},{"v":32,"d":"  32"},{"v":35,"d":"  35"},{"v":725,"d":"  725"},{"v":750,"d":"  750"},{"v":715,"d":"  715"},{"v":190,"d":"  190"},{"v":285,"d":"  285"}]
[null,357,{"$f":"VLOOKUP(Tabelle4[[#This Row],[Spalte1]],AGS_Namen!$C$1:$D$58,2,FALSE)","v":"Rotenburg (Wümme)"},{"v":709,"d":"  709"},{"v":1000,"d":" 1 000"},{"v":43,"d":"  43"},{"v":56,"d":"  56"},{"v":60,"d":"  60"},{"v":1840,"d":" 1 840"},{"v":725,"d":"  725"},{"v":1150,"d":" 1 150"},{"v":725,"d":"  725"},{"v":320,"d":"  320"}]
[null,358,{"$f":"VLOOKUP(Tabelle4[[#This Row],[Spalte1]],AGS_Namen!$C$1:$D$58,2,FALSE)","v":"Heidekreis"},{"v":464,"d":"  464"},{"v":1297,"d":" 1 297"},{"v":91,"d":"  91"},{"v":41,"d":"  41"},{"v":83,"d":"  83"},{"v":2350,"d":" 2 350"},{"v":910,"d":"  910"},{"v":1170,"d":" 1 170"},{"v":745,"d":"  745"},{"v":500,"d":"  500"}]
[null,359,{"$f":"VLOOKUP(Tabelle4[[#This Row],[Spalte1]],AGS_Namen!$C$1:$D$58,2,FALSE)","v":"Stade"},{"v":701,"d":"  701"},{"v":1961,"d":" 1 961"},{"v":70,"d":"  70"},{"v":85,"d":"  85"},{"v":116,"d":"  116"},{"v":3735,"d":" 3 735"},{"v":1775,"d":" 1 775"},{"v":2490,"d":" 2 490"},{"v":1520,"d":" 1 520"},{"v":400,"d":"  400"}]
[null,360,{"$f":"VLOOKUP(Tabelle4[[#This Row],[Spalte1]],AGS_Namen!$C$1:$D$58,2,FALSE)","v":"Uelzen"},{"v":294,"d":"  294"},{"v":356,"d":"  356"},{"v":34,"d":"  34"},{"v":22,"d":"  22"},{"v":61,"d":"  61"},{"v":940,"d":"  940"},{"v":280,"d":"  280"},{"v":710,"d":"  710"},{"v":345,"d":"  345"},{"v":225,"d":"  225"}]
[null,361,{"$f":"VLOOKUP(Tabelle4[[#This Row],[Spalte1]],AGS_Namen!$C$1:$D$58,2,FALSE)","v":"Verden"},{"v":446,"d":"  446"},{"v":2555,"d":" 2 555"},{"v":93,"d":"  93"},{"v":28,"d":"  28"},{"v":111,"d":"  111"},{"v":1385,"d":" 1 385"},{"v":1660,"d":" 1 660"},{"v":1145,"d":" 1 145"},{"v":585,"d":"  585"},{"v":720,"d":"  720"}]
[null,3,{"$f":"VLOOKUP(Tabelle4[[#This Row],[Spalte1]],AGS_Namen!$C$1:$D$58,2,FALSE)","v":"Stat. Region Lüneburg"},{"v":5422,"d":" 5 422"},{"v":14464,"d":" 14 464"},{"v":842,"d":"  842"},{"v":549,"d":"  549"},{"v":911,"d":"  911"},{"v":19240,"d":" 19 240"},{"v":10710,"d":" 10 710"},{"v":13990,"d":" 13 990"},{"v":7930,"d":" 7 930"},{"v":6025,"d":" 6 025"}]
[null,401,{"$f":"VLOOKUP(Tabelle4[[#This Row],[Spalte1]],AGS_Namen!$C$1:$D$58,2,FALSE)","v":"Delmenhorst, Stadt"},{"v":499,"d":"  499"},{"v":3167,"d":" 3 167"},{"v":104,"d":"  104"},{"v":26,"d":"  26"},{"v":70,"d":"  70"},{"v":1425,"d":" 1 425"},{"v":2305,"d":" 2 305"},{"v":1775,"d":" 1 775"},{"v":1120,"d":" 1 120"},{"v":995,"d":"  995"}]
[null,402,{"$f":"VLOOKUP(Tabelle4[[#This Row],[Spalte1]],AGS_Namen!$C$1:$D$58,2,FALSE)","v":"Emden, Stadt"},{"v":270,"d":"  270"},{"v":373,"d":"  373"},{"v":1,"d":"  1"},{"v":39,"d":"  39"},{"v":27,"d":"  27"},{"v":835,"d":"  835"},{"v":270,"d":"  270"},{"v":945,"d":"  945"},{"v":570,"d":"  570"},{"v":160,"d":"  160"}]
[null,403,{"$f":"VLOOKUP(Tabelle4[[#This Row],[Spalte1]],AGS_Namen!$C$1:$D$58,2,FALSE)","v":"Oldenburg (Oldb), Stadt"},{"v":715,"d":"  715"},{"v":2137,"d":" 2 137"},{"v":92,"d":"  92"},{"v":115,"d":"  115"},{"v":445,"d":"  445"},{"v":1365,"d":" 1 365"},{"v":1440,"d":" 1 440"},{"v":2040,"d":" 2 040"},{"v":965,"d":"  965"},{"v":3370,"d":" 3 370"}]
[null,404,{"$f":"VLOOKUP(Tabelle4[[#This Row],[Spalte1]],AGS_Namen!$C$1:$D$58,2,FALSE)","v":"Osnabrück, Stadt"},{"v":619,"d":"  619"},{"v":3213,"d":" 3 213"},{"v":72,"d":"  72"},{"v":59,"d":"  59"},{"v":41,"d":"  41"},{"v":1585,"d":" 1 585"},{"v":2640,"d":" 2 640"},{"v":3300,"d":" 3 300"},{"v":975,"d":"  975"},{"v":575,"d":"  575"}]
[null,405,{"$f":"VLOOKUP(Tabelle4[[#This Row],[Spalte1]],AGS_Namen!$C$1:$D$58,2,FALSE)","v":"Wilhelmshaven, Stadt"},{"v":214,"d":"  214"},{"v":691,"d":"  691"},{"v":56,"d":"  56"},{"v":15,"d":"  15"},{"v":94,"d":"  94"},{"v":680,"d":"  680"},{"v":475,"d":"  475"},{"v":2100,"d":" 2 100"},{"v":525,"d":"  525"},{"v":650,"d":"  650"}]
[null,451,{"$f":"VLOOKUP(Tabelle4[[#This Row],[Spalte1]],AGS_Namen!$C$1:$D$58,2,FALSE)","v":"Ammerland"},{"v":271,"d":"  271"},{"v":722,"d":"  722"},{"v":97,"d":"  97"},{"v":25,"d":"  25"},{"v":92,"d":"  92"},{"v":1655,"d":" 1 655"},{"v":500,"d":"  500"},{"v":1090,"d":" 1 090"},{"v":785,"d":"  785"},{"v":595,"d":"  595"}]
[null,452,{"$f":"VLOOKUP(Tabelle4[[#This Row],[Spalte1]],AGS_Namen!$C$1:$D$58,2,FALSE)","v":"Aurich"},{"v":314,"d":"  314"},{"v":440,"d":"  440"},{"v":87,"d":"  87"},{"v":31,"d":"  31"},{"v":83,"d":"  83"},{"v":1495,"d":" 1 495"},{"v":425,"d":"  425"},{"v":1705,"d":" 1 705"},{"v":1075,"d":" 1 075"},{"v":285,"d":"  285"}]
[null,453,{"$f":"VLOOKUP(Tabelle4[[#This Row],[Spalte1]],AGS_Namen!$C$1:$D$58,2,FALSE)","v":"Cloppenburg"},{"v":782,"d":"  782"},{"v":1028,"d":" 1 028"},{"v":138,"d":"  138"},{"v":34,"d":"  34"},{"v":149,"d":"  149"},{"v":3420,"d":" 3 420"},{"v":745,"d":"  745"},{"v":1370,"d":" 1 370"},{"v":4515,"d":" 4 515"},{"v":1110,"d":" 1 110"}]
[null,454,{"$f":"VLOOKUP(Tabelle4[[#This Row],[Spalte1]],AGS_Namen!$C$1:$D$58,2,FALSE)","v":"Emsland"},{"v":1625,"d":" 1 625"},{"v":1204,"d":" 1 204"},{"v":102,"d":"  102"},{"v":76,"d":"  76"},{"v":157,"d":"  157"},{"v":7360,"d":" 7 360"},{"v":900,"d":"  900"},{"v":2890,"d":" 2 890"},{"v":6875,"d":" 6 875"},{"v":990,"d":"  990"}]
[null,455,{"$f":"VLOOKUP(Tabelle4[[#This Row],[Spalte1]],AGS_Namen!$C$1:$D$58,2,FALSE)","v":"Friesland"},{"v":167,"d":"  167"},{"v":345,"d":"  345"},{"v":40,"d":"  40"},{"v":23,"d":"  23"},{"v":45,"d":"  45"},{"v":475,"d":"  475"},{"v":225,"d":"  225"},{"v":805,"d":"  805"},{"v":185,"d":"  185"},{"v":170,"d":"  170"}]
[null,456,{"$f":"VLOOKUP(Tabelle4[[#This Row],[Spalte1]],AGS_Namen!$C$1:$D$58,2,FALSE)","v":"Grafschaft Bentheim"},{"v":328,"d":"  328"},{"v":1750,"d":" 1 750"},{"v":97,"d":"  97"},{"v":37,"d":"  37"},{"v":140,"d":"  140"},{"v":2630,"d":" 2 630"},{"v":1215,"d":" 1 215"},{"v":1200,"d":" 1 200"},{"v":725,"d":"  725"},{"v":355,"d":"  355"}]
[null,457,{"$f":"VLOOKUP(Tabelle4[[#This Row],[Spalte1]],AGS_Namen!$C$1:$D$58,2,FALSE)","v":"Leer"},{"v":399,"d":"  399"},{"v":639,"d":"  639"},{"v":111,"d":"  111"},{"v":122,"d":"  122"},{"v":98,"d":"  98"},{"v":1240,"d":" 1 240"},{"v":495,"d":"  495"},{"v":1655,"d":" 1 655"},{"v":1635,"d":" 1 635"},{"v":455,"d":"  455"}]
[null,458,{"$f":"VLOOKUP(Tabelle4[[#This Row],[Spalte1]],AGS_Namen!$C$1:$D$58,2,FALSE)","v":"Oldenburg"},{"v":406,"d":"  406"},{"v":627,"d":"  627"},{"v":119,"d":"  119"},{"v":36,"d":"  36"},{"v":224,"d":"  224"},{"v":1820,"d":" 1 820"},{"v":390,"d":"  390"},{"v":945,"d":"  945"},{"v":2405,"d":" 2 405"},{"v":1280,"d":" 1 280"}]
[null,459,{"$f":"VLOOKUP(Tabelle4[[#This Row],[Spalte1]],AGS_Namen!$C$1:$D$58,2,FALSE)","v":"Osnabrück"},{"v":1099,"d":" 1 099"},{"v":3684,"d":" 3 684"},{"v":172,"d":"  172"},{"v":131,"d":"  131"},{"v":181,"d":"  181"},{"v":4895,"d":" 4 895"},{"v":3065,"d":" 3 065"},{"v":2255,"d":" 2 255"},{"v":5560,"d":" 5 560"},{"v":735,"d":"  735"}]
[null,460,{"$f":"VLOOKUP(Tabelle4[[#This Row],[Spalte1]],AGS_Namen!$C$1:$D$58,2,FALSE)","v":"Vechta"},{"v":906,"d":"  906"},{"v":3143,"d":" 3 143"},{"v":207,"d":"  207"},{"v":86,"d":"  86"},{"v":160,"d":"  160"},{"v":3900,"d":" 3 900"},{"v":2380,"d":" 2 380"},{"v":2685,"d":" 2 685"},{"v":3020,"d":" 3 020"},{"v":895,"d":"  895"}]
[null,461,{"$f":"VLOOKUP(Tabelle4[[#This Row],[Spalte1]],AGS_Namen!$C$1:$D$58,2,FALSE)","v":"Wesermarsch"},{"v":356,"d":"  356"},{"v":1574,"d":" 1 574"},{"v":43,"d":"  43"},{"v":80,"d":"  80"},{"v":77,"d":"  77"},{"v":1110,"d":" 1 110"},{"v":1110,"d":" 1 110"},{"v":735,"d":"  735"},{"v":415,"d":"  415"},{"v":305,"d":"  305"}]
[null,462,{"$f":"VLOOKUP(Tabelle4[[#This Row],[Spalte1]],AGS_Namen!$C$1:$D$58,2,FALSE)","v":"Wittmund"},{"v":92,"d":"  92"},{"v":164,"d":"  164"},{"v":7,"d":"  7"},{"v":8,"d":"  8"},{"v":13,"d":"  13"},{"v":395,"d":"  395"},{"v":75,"d":"  75"},{"v":325,"d":"  325"},{"v":225,"d":"  225"},{"v":115,"d":"  115"}]
[null,4,{"$f":"VLOOKUP(Tabelle4[[#This Row],[Spalte1]],AGS_Namen!$C$1:$D$58,2,FALSE)","v":"Stat. Region Weser-Ems"},{"v":9062,"d":" 9 062"},{"v":24901,"d":" 24 901"},{"v":1545,"d":" 1 545"},{"v":943,"d":"  943"},{"v":2096,"d":" 2 096"},{"v":36290,"d":" 36 290"},{"v":18660,"d":" 18 660"},{"v":27820,"d":" 27 820"},{"v":31580,"d":" 31 580"},{"v":13040,"d":" 13 040"}]
[null,0,{"$f":"VLOOKUP(Tabelle4[[#This Row],[Spalte1]],AGS_Namen!$C$1:$D$58,2,FALSE)","v":"Niedersachsen"},{"v":32413,"d":" 32 413"},{"v":111598,"d":" 111 598"},{"v":5458,"d":" 5 458"},{"v":3382,"d":" 3 382"},{"v":7448,"d":" 7 448"},{"v":98015,"d":" 98 015"},{"v":88735,"d":" 88 735"},{"v":84805,"d":" 84 805"},{"v":58980,"d":" 58 980"},{"v":41035,"d":" 41 035"}]
[]
[null,null,"1) Aufgeführt sind die Länder der fünf häufigsten Staatsangehörigkeiten der Ausländerinnen und Ausländer 2019 in Niedersachsen."]
[]
[null,null,"Quelle: Ausländerzentralregister"]
[]
[]
[null,null,"Karte A4-2: Veränderung der Zahl der Ausländerinnen und Ausländer von 31.12.2019 gegenüber 31.12.2005 in Prozent "]
{"$rows_empty":52}
[null,null,{"$f":"Def","v":"Die Definition zu dem Indikator sowie methodische Hinweise finden Sie in der Tabelle Aktuelle Ergebnisse"}]
[null,null,{"$f":"Link_LSNOnline","v":"Link zur LSN-Online-Datenbank"}]

{"sheet":"A5","index":10,"n_rows":153,"n_cols":14,"rows_kept":153,"merged":[[2,2,2,3],[5,2,5,10],[9,2,12,2],[9,3,11,3],[9,4,9,13],[10,4,11,4],[10,5,10,11],[10,12,11,12],[10,13,11,13],[71,2,72,12]]}
[null,null,{"$f":"Kopf","v":"Migration und Teilhabe in Niedersachsen - Integrationsmonitoring 2020 - Regionalinformationen "}]
[]
[]
[]
[null,null,"Indikator A5: Geflüchtete und geduldete Personen in Niedersachsen"]
[null,null,"Tabelle A5-2: Geflüchtete und geduldete Personen 2019 (31.12.) nach Aufenthaltsstatus und Kreisen"]
[]
[]
[]
[null,null,"Kreisfreie Stadt\nLandkreis\n(Großstadt, Umland)\nStatistische Region\nLand","Geflüchtete und geduldete Personen insgesamt","davon  "]
[{"$nulls":4},"davon mit Niederlassungs-erlaubnis ","davon mit befristeter Aufenthaltserlaubnis",{"$nulls":6},"Duldung","Familiennachzug"]
[{"$nulls":5},"Asyl-berechtigte, \nGFK-Flüchtlinge","Aufnahme-erklärung, \nvor. Schutz, Resettlement, Kontingent-flüchtlinge","Verbot der Abschiebung, Subsidiärer Schutz","Unmöglichkeit der Ausreise aus rechtl. oder tats. Gründen","Bleiberecht (Aufenthalts-gewährung); \nOpfer von Menschen- handel und organisierter Schwarzarbeit","Dringende persönliche oder humanitäre Gründe, Härtefälle","Aufenthalts-gestattung zum Asylverfahren"]
[{"$nulls":3},"Anzahl"]
[null,"Spalte1","1","3","4","5","6","7","8","9","10","11","12","13"]
[null,101,{"$f":"VLOOKUP(Datenbereich_A5[[#This Row],[Spalte1]],AGS_Namen!$C$1:$D$58,2,FALSE)","v":"Braunschweig, Stadt"},{"v":5010,"d":" 5 010"},{"v":400,"d":"  400"},{"v":1505,"d":" 1 505"},{"v":75,"d":"  75"},{"v":690,"d":"  690"},{"v":60,"d":"  60"},{"v":80,"d":"  80"},{"v":50,"d":"  50"},{"v":1585,"d":" 1 585"},{"v":480,"d":"  480"},{"v":90,"d":"  90"}]
[null,102,{"$f":"VLOOKUP(Datenbereich_A5[[#This Row],[Spalte1]],AGS_Namen!$C$1:$D$58,2,FALSE)","v":"Salzgitter, Stadt"},{"v":5510,"d":" 5 510"},{"v":270,"d":"  270"},{"v":3190,"d":" 3 190"},{"v":35,"d":"  35"},{"v":1385,"d":" 1 385"},{"v":20,"d":"  20"},{"v":55,"d":"  55"},{"v":80,"d":"  80"},{"v":255,"d":"  255"},{"v":225,"d":"  225"},{"v":5,"d":"  5"}]
[null,103,{"$f":"VLOOKUP(Datenbereich_A5[[#This Row],[Spalte1]],AGS_Namen!$C$1:$D$58,2,FALSE)","v":"Wolfsburg, Stadt"},{"v":3680,"d":" 3 680"},{"v":330,"d":"  330"},{"v":1365,"d":" 1 365"},{"v":30,"d":"  30"},{"v":795,"d":"  795"},{"v":140,"d":"  140"},{"v":65,"d":"  65"},{"v":55,"d":"  55"},{"v":505,"d":"  505"},{"v":385,"d":"  385"},{"v":10,"d":"  10"}]
[null,151,{"$f":"VLOOKUP(Datenbereich_A5[[#This Row],[Spalte1]],AGS_Namen!$C$1:$D$58,2,FALSE)","v":"Gifhorn"},{"v":2850,"d":" 2 850"},{"v":170,"d":"  170"},{"v":740,"d":"  740"},{"v":0,"d":"  0"},{"v":530,"d":"  530"},{"v":75,"d":"  75"},{"v":25,"d":"  25"},{"v":85,"d":"  85"},{"v":815,"d":"  815"},{"v":405,"d":"  405"},{"v":10,"d":"  10"}]
[null,153,{"$f":"VLOOKUP(Datenbereich_A5[[#This Row],[Spalte1]],AGS_Namen!$C$1:$D$58,2,FALSE)","v":"Goslar"},{"v":3180,"d":" 3 180"},{"v":250,"d":"  250"},{"v":1165,"d":" 1 165"},{"v":215,"d":"  215"},{"v":700,"d":"  700"},{"v":145,"d":"  145"},{"v":25,"d":"  25"},{"v":50,"d":"  50"},{"v":260,"d":"  260"},{"v":345,"d":"  345"},{"v":30,"d":"  30"}]
[null,154,{"$f":"VLOOKUP(Datenbereich_A5[[#This Row],[Spalte1]],AGS_Namen!$C$1:$D$58,2,FALSE)","v":"Helmstedt"},{"v":1630,"d":" 1 630"},{"v":95,"d":"  95"},{"v":550,"d":"  550"},{"v":5,"d":"  5"},{"v":375,"d":"  375"},{"v":25,"d":"  25"},{"v":25,"d":"  25"},{"v":20,"d":"  20"},{"v":245,"d":"  245"},{"v":270,"d":"  270"},{"v":15,"d":"  15"}]
[null,155,{"$f":"VLOOKUP(Datenbereich_A5[[#This Row],[Spalte1]],AGS_Namen!$C$1:$D$58,2,FALSE)","v":"Northeim"},{"v":2790,"d":" 2 790"},{"v":425,"d":"  425"},{"v":860,"d":"  860"},{"v":50,"d":"  50"},{"v":550,"d":"  550"},{"v":90,"d":"  90"},{"v":50,"d":"  50"},{"v":115,"d":"  115"},{"v":355,"d":"  355"},{"v":305,"d":"  305"},{"v":0,"d":"  0"}]
[null,157,{"$f":"VLOOKUP(Datenbereich_A5[[#This Row],[Spalte1]],AGS_Namen!$C$1:$D$58,2,FALSE)","v":"Peine"},{"v":3280,"d":" 3 280"},{"v":305,"d":"  305"},{"v":1255,"d":" 1 255"},{"v":35,"d":"  35"},{"v":745,"d":"  745"},{"v":115,"d":"  115"},{"v":50,"d":"  50"},{"v":75,"d":"  75"},{"v":380,"d":"  380"},{"v":280,"d":"  280"},{"v":40,"d":"  40"}]
[null,158,{"$f":"VLOOKUP(Datenbereich_A5[[#This Row],[Spalte1]],AGS_Namen!$C$1:$D$58,2,FALSE)","v":"Wolfenbüttel"},{"v":2230,"d":" 2 230"},{"v":125,"d":"  125"},{"v":700,"d":"  700"},{"v":35,"d":"  35"},{"v":605,"d":"  605"},{"v":50,"d":"  50"},{"v":10,"d":"  10"},{"v":20,"d":"  20"},{"v":310,"d":"  310"},{"v":370,"d":"  370"},{"v":5,"d":"  5"}]
[null,159,{"$f":"VLOOKUP(Datenbereich_A5[[#This Row],[Spalte1]],AGS_Namen!$C$1:$D$58,2,FALSE)","v":"Göttingen"},{"v":6445,"d":" 6 445"},{"v":755,"d":"  755"},{"v":1670,"d":" 1 670"},{"v":140,"d":"  140"},{"v":1165,"d":" 1 165"},{"v":355,"d":"  355"},{"v":80,"d":"  80"},{"v":75,"d":"  75"},{"v":1040,"d":" 1 040"},{"v":1110,"d":" 1 110"},{"v":60,"d":"  60"}]
[null,1,{"$f":"VLOOKUP(Datenbereich_A5[[#This Row],[Spalte1]],AGS_Namen!$C$1:$D$58,2,FALSE)","v":"Stat. Region Braunschweig"},{"v":36610,"d":" 36 610"},{"v":3120,"d":" 3 120"},{"v":13000,"d":" 13 000"},{"v":625,"d":"  625"},{"v":7535,"d":" 7 535"},{"v":1075,"d":" 1 075"},{"v":460,"d":"  460"},{"v":620,"d":"  620"},{"v":5750,"d":" 5 750"},{"v":4165,"d":" 4 165"},{"v":260,"d":"  260"}]
[null,241,{"$f":"VLOOKUP(Datenbereich_A5[[#This Row],[Spalte1]],AGS_Namen!$C$1:$D$58,2,FALSE)","v":"Hannover, Region"},{"v":41725,"d":" 41 725"},{"v":10095,"d":" 10 095"},{"v":15505,"d":" 15 505"},{"v":610,"d":"  610"},{"v":6100,"d":" 6 100"},{"v":780,"d":"  780"},{"v":265,"d":"  265"},{"v":770,"d":"  770"},{"v":3905,"d":" 3 905"},{"v":2845,"d":" 2 845"},{"v":850,"d":"  850"}]
[null,241001,{"$f":"VLOOKUP(Datenbereich_A5[[#This Row],[Spalte1]],AGS_Namen!$C$1:$D$58,2,FALSE)","v":"   dav. Hannover, Lhst."},{"v":21345,"d":" 21 345"},{"v":6480,"d":" 6 480"},{"v":7160,"d":" 7 160"},{"v":240,"d":"  240"},{"v":2670,"d":" 2 670"},{"v":410,"d":"  410"},{"v":165,"d":"  165"},{"v":425,"d":"  425"},{"v":1820,"d":" 1 820"},{"v":1365,"d":" 1 365"},{"v":610,"d":"  610"}]
[null,241999,{"$f":"VLOOKUP(Datenbereich_A5[[#This Row],[Spalte1]],AGS_Namen!$C$1:$D$58,2,FALSE)","v":"   dav. Hannover, Umland"},{"v":20380,"d":" 20 380"},{"v":3615,"d":" 3 615"},{"v":8345,"d":" 8 345"},{"v":370,"d":"  370"},{"v":3430,"d":" 3 430"},{"v":370,"d":"  370"},{"v":100,"d":"  100"},{"v":345,"d":"  345"},{"v":2085,"d":" 2 085"},{"v":1480,"d":" 1 480"},{"v":240,"d":"  240"}]
[null,251,{"$f":"VLOOKUP(Datenbereich_A5[[#This Row],[Spalte1]],AGS_Namen!$C$1:$D$58,2,FALSE)","v":"Diepholz"},{"v":5170,"d":" 5 170"},{"v":420,"d":"  420"},{"v":1635,"d":" 1 635"},{"v":65,"d":"  65"},{"v":1105,"d":" 1 105"},{"v":230,"d":"  230"},{"v":25,"d":"  25"},{"v":125,"d":"  125"},{"v":935,"d":"  935"},{"v":625,"d":"  625"},{"v":0,"d":"  0"}]
[null,252,{"$f":"VLOOKUP(Datenbereich_A5[[#This Row],[Spalte1]],AGS_Namen!$C$1:$D$58,2,FALSE)","v":"Hameln-Pyrmont"},{"v":4980,"d":" 4 980"},{"v":760,"d":"  760"},{"v":2005,"d":" 2 005"},{"v":60,"d":"  60"},{"v":965,"d":"  965"},{"v":120,"d":"  120"},{"v":30,"d":"  30"},{"v":115,"d":"  115"},{"v":460,"d":"  460"},{"v":450,"d":"  450"},{"v":5,"d":"  5"}]
[null,254,{"$f":"VLOOKUP(Datenbereich_A5[[#This Row],[Spalte1]],AGS_Namen!$C$1:$D$58,2,FALSE)","v":"Hildesheim"},{"v":6770,"d":" 6 770"},{"v":935,"d":"  935"},{"v":2520,"d":" 2 520"},{"v":35,"d":"  35"},{"v":1255,"d":" 1 255"},{"v":170,"d":"  170"},{"v":45,"d":"  45"},{"v":145,"d":"  145"},{"v":1000,"d":" 1 000"},{"v":645,"d":"  645"},{"v":20,"d":"  20"}]
[null,255,{"$f":"VLOOKUP(Datenbereich_A5[[#This Row],[Spalte1]],AGS_Namen!$C$1:$D$58,2,FALSE)","v":"Holzminden"},{"v":1185,"d":" 1 185"},{"v":85,"d":"  85"},{"v":405,"d":"  405"},{"v":5,"d":"  5"},{"v":300,"d":"  300"},{"v":20,"d":"  20"},{"v":20,"d":"  20"},{"v":20,"d":"  20"},{"v":230,"d":"  230"},{"v":100,"d":"  100"},{"v":0,"d":"  0"}]
[null,256,{"$f":"VLOOKUP(Datenbereich_A5[[#This Row],[Spalte1]],AGS_Namen!$C$1:$D$58,2,FALSE)","v":"Nienburg (Weser)"},{"v":3370,"d":" 3 370"},{"v":370,"d":"  370"},{"v":1265,"d":" 1 265"},{"v":75,"d":"  75"},{"v":800,"d":"  800"},{"v":75,"d":"  75"},{"v":20,"d":"  20"},{"v":55,"d":"  55"},{"v":415,"d":"  415"},{"v":295,"d":"  295"},{"v":5,"d":"  5"}]
[null,257,{"$f":"VLOOKUP(Datenbereich_A5[[#This Row],[Spalte1]],AGS_Namen!$C$1:$D$58,2,FALSE)","v":"Schaumburg"},{"v":4120,"d":" 4 120"},{"v":350,"d":"  350"},{"v":1350,"d":" 1 350"},{"v":10,"d":"  10"},{"v":945,"d":"  945"},{"v":105,"d":"  105"},{"v":5,"d":"  5"},{"v":100,"d":"  100"},{"v":715,"d":"  715"},{"v":530,"d":"  530"},{"v":5,"d":"  5"}]
[null,2,{"$f":"VLOOKUP(Datenbereich_A5[[#This Row],[Spalte1]],AGS_Namen!$C$1:$D$58,2,FALSE)","v":"Stat. Region Hannover"},{"v":67310,"d":" 67 310"},{"v":13015,"d":" 13 015"},{"v":24685,"d":" 24 685"},{"v":865,"d":"  865"},{"v":11465,"d":" 11 465"},{"v":1500,"d":" 1 500"},{"v":415,"d":"  415"},{"v":1330,"d":" 1 330"},{"v":7660,"d":" 7 660"},{"v":5490,"d":" 5 490"},{"v":885,"d":"  885"}]
[null,351,{"$f":"VLOOKUP(Datenbereich_A5[[#This Row],[Spalte1]],AGS_Namen!$C$1:$D$58,2,FALSE)","v":"Celle"},{"v":4700,"d":" 4 700"},{"v":520,"d":"  520"},{"v":2260,"d":" 2 260"},{"v":10,"d":"  10"},{"v":915,"d":"  915"},{"v":115,"d":"  115"},{"v":30,"d":"  30"},{"v":150,"d":"  150"},{"v":325,"d":"  325"},{"v":375,"d":"  375"},{"v":0,"d":"  0"}]
[null,352,{"$f":"VLOOKUP(Datenbereich_A5[[#This Row],[Spalte1]],AGS_Namen!$C$1:$D$58,2,FALSE)","v":"Cuxhaven"},{"v":3550,"d":" 3 550"},{"v":280,"d":"  280"},{"v":1125,"d":" 1 125"},{"v":65,"d":"  65"},{"v":920,"d":"  920"},{"v":120,"d":"  120"},{"v":25,"d":"  25"},{"v":110,"d":"  110"},{"v":525,"d":"  525"},{"v":385,"d":"  385"},{"v":5,"d":"  5"}]
[null,353,{"$f":"VLOOKUP(Datenbereich_A5[[#This Row],[Spalte1]],AGS_Namen!$C$1:$D$58,2,FALSE)","v":"Harburg"},{"v":4120,"d":" 4 120"},{"v":430,"d":"  430"},{"v":1005,"d":" 1 005"},{"v":30,"d":"  30"},{"v":630,"d":"  630"},{"v":130,"d":"  130"},{"v":15,"d":"  15"},{"v":60,"d":"  60"},{"v":835,"d":"  835"},{"v":975,"d":"  975"},{"v":10,"d":"  10"}]
[null,354,{"$f":"VLOOKUP(Datenbereich_A5[[#This Row],[Spalte1]],AGS_Namen!$C$1:$D$58,2,FALSE)","v":"Lüchow-Dannenberg"},{"v":655,"d":"  655"},{"v":45,"d":"  45"},{"v":185,"d":"  185"},{"v":10,"d":"  10"},{"v":145,"d":"  145"},{"v":25,"d":"  25"},{"v":10,"d":"  10"},{"v":30,"d":"  30"},{"v":120,"d":"  120"},{"v":85,"d":"  85"},{"v":0,"d":"  0"}]
[null,355,{"$f":"VLOOKUP(Datenbereich_A5[[#This Row],[Spalte1]],AGS_Namen!$C$1:$D$58,2,FALSE)","v":"Lüneburg"},{"v":4090,"d":" 4 090"},{"v":320,"d":"  320"},{"v":1905,"d":" 1 905"},{"v":35,"d":"  35"},{"v":790,"d":"  790"},{"v":135,"d":"  135"},{"v":10,"d":"  10"},{"v":60,"d":"  60"},{"v":425,"d":"  425"},{"v":400,"d":"  400"},{"v":15,"d":"  15"}]
[null,356,{"$f":"VLOOKUP(Datenbereich_A5[[#This Row],[Spalte1]],AGS_Namen!$C$1:$D$58,2,FALSE)","v":"Osterholz"},{"v":2080,"d":" 2 080"},{"v":250,"d":"  250"},{"v":625,"d":"  625"},{"v":15,"d":"  15"},{"v":435,"d":"  435"},{"v":160,"d":"  160"},{"v":60,"d":"  60"},{"v":45,"d":"  45"},{"v":275,"d":"  275"},{"v":195,"d":"  195"},{"v":15,"d":"  15"}]
[null,357,{"$f":"VLOOKUP(Datenbereich_A5[[#This Row],[Spalte1]],AGS_Namen!$C$1:$D$58,2,FALSE)","v":"Rotenburg (Wümme)"},{"v":2925,"d":" 2 925"},{"v":350,"d":"  350"},{"v":730,"d":"  730"},{"v":40,"d":"  40"},{"v":675,"d":"  675"},{"v":90,"d":"  90"},{"v":15,"d":"  15"},{"v":95,"d":"  95"},{"v":580,"d":"  580"},{"v":335,"d":"  335"},{"v":5,"d":"  5"}]
[null,358,{"$f":"VLOOKUP(Datenbereich_A5[[#This Row],[Spalte1]],AGS_Namen!$C$1:$D$58,2,FALSE)","v":"Heidekreis"},{"v":2800,"d":" 2 800"},{"v":455,"d":"  455"},{"v":900,"d":"  900"},{"v":10,"d":"  10"},{"v":370,"d":"  370"},{"v":160,"d":"  160"},{"v":55,"d":"  55"},{"v":85,"d":"  85"},{"v":495,"d":"  495"},{"v":265,"d":"  265"},{"v":5,"d":"  5"}]
[null,359,{"$f":"VLOOKUP(Datenbereich_A5[[#This Row],[Spalte1]],AGS_Namen!$C$1:$D$58,2,FALSE)","v":"Stade"},{"v":4830,"d":" 4 830"},{"v":225,"d":"  225"},{"v":1500,"d":" 1 500"},{"v":100,"d":"  100"},{"v":1280,"d":" 1 280"},{"v":190,"d":"  190"},{"v":25,"d":"  25"},{"v":50,"d":"  50"},{"v":910,"d":"  910"},{"v":555,"d":"  555"},{"v":5,"d":"  5"}]
[null,360,{"$f":"VLOOKUP(Datenbereich_A5[[#This Row],[Spalte1]],AGS_Namen!$C$1:$D$58,2,FALSE)","v":"Uelzen"},{"v":1510,"d":" 1 510"},{"v":135,"d":"  135"},{"v":550,"d":"  550"},{"v":30,"d":"  30"},{"v":315,"d":"  315"},{"v":60,"d":"  60"},{"v":65,"d":"  65"},{"v":20,"d":"  20"},{"v":180,"d":"  180"},{"v":150,"d":"  150"},{"v":5,"d":"  5"}]
[null,361,{"$f":"VLOOKUP(Datenbereich_A5[[#This Row],[Spalte1]],AGS_Namen!$C$1:$D$58,2,FALSE)","v":"Verden"},{"v":3310,"d":" 3 310"},{"v":335,"d":"  335"},{"v":1230,"d":" 1 230"},{"v":35,"d":"  35"},{"v":625,"d":"  625"},{"v":175,"d":"  175"},{"v":20,"d":"  20"},{"v":80,"d":"  80"},{"v":565,"d":"  565"},{"v":240,"d":"  240"},{"v":5,"d":"  5"}]
[null,3,{"$f":"VLOOKUP(Datenbereich_A5[[#This Row],[Spalte1]],AGS_Namen!$C$1:$D$58,2,FALSE)","v":"Stat. Region Lüneburg"},{"v":34575,"d":" 34 575"},{"v":3345,"d":" 3 345"},{"v":12020,"d":" 12 020"},{"v":380,"d":"  380"},{"v":7105,"d":" 7 105"},{"v":1355,"d":" 1 355"},{"v":330,"d":"  330"},{"v":780,"d":"  780"},{"v":5235,"d":" 5 235"},{"v":3955,"d":" 3 955"},{"v":70,"d":"  70"}]
[null,401,{"$f":"VLOOKUP(Datenbereich_A5[[#This Row],[Spalte1]],AGS_Namen!$C$1:$D$58,2,FALSE)","v":"Delmenhorst, Stadt"},{"v":3405,"d":" 3 405"},{"v":385,"d":"  385"},{"v":1650,"d":" 1 650"},{"v":85,"d":"  85"},{"v":595,"d":"  595"},{"v":105,"d":"  105"},{"v":20,"d":"  20"},{"v":135,"d":"  135"},{"v":265,"d":"  265"},{"v":155,"d":"  155"},{"v":5,"d":"  5"}]
[null,402,{"$f":"VLOOKUP(Datenbereich_A5[[#This Row],[Spalte1]],AGS_Namen!$C$1:$D$58,2,FALSE)","v":"Emden, Stadt"},{"v":1470,"d":" 1 470"},{"v":95,"d":"  95"},{"v":655,"d":"  655"},{"v":40,"d":"  40"},{"v":280,"d":"  280"},{"v":55,"d":"  55"},{"v":30,"d":"  30"},{"v":50,"d":"  50"},{"v":145,"d":"  145"},{"v":115,"d":"  115"},{"v":5,"d":"  5"}]
[null,403,{"$f":"VLOOKUP(Datenbereich_A5[[#This Row],[Spalte1]],AGS_Namen!$C$1:$D$58,2,FALSE)","v":"Oldenburg (Oldb), Stadt"},{"v":5915,"d":" 5 915"},{"v":735,"d":"  735"},{"v":3510,"d":" 3 510"},{"v":20,"d":"  20"},{"v":795,"d":"  795"},{"v":45,"d":"  45"},{"v":40,"d":"  40"},{"v":50,"d":"  50"},{"v":440,"d":"  440"},{"v":270,"d":"  270"},{"v":15,"d":"  15"}]
[null,404,{"$f":"VLOOKUP(Datenbereich_A5[[#This Row],[Spalte1]],AGS_Namen!$C$1:$D$58,2,FALSE)","v":"Osnabrück, Stadt"},{"v":5655,"d":" 5 655"},{"v":740,"d":"  740"},{"v":2180,"d":" 2 180"},{"v":120,"d":"  120"},{"v":1025,"d":" 1 025"},{"v":100,"d":"  100"},{"v":40,"d":"  40"},{"v":65,"d":"  65"},{"v":810,"d":"  810"},{"v":555,"d":"  555"},{"v":15,"d":"  15"}]
[null,405,{"$f":"VLOOKUP(Datenbereich_A5[[#This Row],[Spalte1]],AGS_Namen!$C$1:$D$58,2,FALSE)","v":"Wilhelmshaven, Stadt"},{"v":2870,"d":" 2 870"},{"v":165,"d":"  165"},{"v":1395,"d":" 1 395"},{"v":45,"d":"  45"},{"v":775,"d":"  775"},{"v":100,"d":"  100"},{"v":20,"d":"  20"},{"v":35,"d":"  35"},{"v":150,"d":"  150"},{"v":180,"d":"  180"},{"v":5,"d":"  5"}]
[null,451,{"$f":"VLOOKUP(Datenbereich_A5[[#This Row],[Spalte1]],AGS_Namen!$C$1:$D$58,2,FALSE)","v":"Ammerland"},{"v":2650,"d":" 2 650"},{"v":210,"d":"  210"},{"v":965,"d":"  965"},{"v":15,"d":"  15"},{"v":575,"d":"  575"},{"v":60,"d":"  60"},{"v":25,"d":"  25"},{"v":30,"d":"  30"},{"v":570,"d":"  570"},{"v":195,"d":"  195"},{"v":5,"d":"  5"}]
[null,452,{"$f":"VLOOKUP(Datenbereich_A5[[#This Row],[Spalte1]],AGS_Namen!$C$1:$D$58,2,FALSE)","v":"Aurich"},{"v":3305,"d":" 3 305"},{"v":340,"d":"  340"},{"v":1185,"d":" 1 185"},{"v":25,"d":"  25"},{"v":545,"d":"  545"},{"v":95,"d":"  95"},{"v":55,"d":"  55"},{"v":115,"d":"  115"},{"v":485,"d":"  485"},{"v":455,"d":"  455"},{"v":5,"d":"  5"}]
[null,453,{"$f":"VLOOKUP(Datenbereich_A5[[#This Row],[Spalte1]],AGS_Namen!$C$1:$D$58,2,FALSE)","v":"Cloppenburg"},{"v":3420,"d":" 3 420"},{"v":445,"d":"  445"},{"v":1225,"d":" 1 225"},{"v":30,"d":"  30"},{"v":850,"d":"  850"},{"v":105,"d":"  105"},{"v":30,"d":"  30"},{"v":35,"d":"  35"},{"v":455,"d":"  455"},{"v":240,"d":"  240"},{"v":5,"d":"  5"}]
[null,454,{"$f":"VLOOKUP(Datenbereich_A5[[#This Row],[Spalte1]],AGS_Namen!$C$1:$D$58,2,FALSE)","v":"Emsland"},{"v":6350,"d":" 6 350"},{"v":530,"d":"  530"},{"v":2040,"d":" 2 040"},{"v":70,"d":"  70"},{"v":1675,"d":" 1 675"},{"v":190,"d":"  190"},{"v":100,"d":"  100"},{"v":115,"d":"  115"},{"v":885,"d":"  885"},{"v":730,"d":"  730"},{"v":15,"d":"  15"}]
[null,455,{"$f":"VLOOKUP(Datenbereich_A5[[#This Row],[Spalte1]],AGS_Namen!$C$1:$D$58,2,FALSE)","v":"Friesland"},{"v":1985,"d":" 1 985"},{"v":135,"d":"  135"},{"v":550,"d":"  550"},{"v":20,"d":"  20"},{"v":545,"d":"  545"},{"v":50,"d":"  50"},{"v":10,"d":"  10"},{"v":50,"d":"  50"},{"v":325,"d":"  325"},{"v":300,"d":"  300"},{"v":0,"d":"  0"}]
[null,456,{"$f":"VLOOKUP(Datenbereich_A5[[#This Row],[Spalte1]],AGS_Namen!$C$1:$D$58,2,FALSE)","v":"Grafschaft Bentheim"},{"v":2560,"d":" 2 560"},{"v":100,"d":"  100"},{"v":900,"d":"  900"},{"v":35,"d":"  35"},{"v":520,"d":"  520"},{"v":85,"d":"  85"},{"v":75,"d":"  75"},{"v":80,"d":"  80"},{"v":400,"d":"  400"},{"v":365,"d":"  365"},{"v":5,"d":"  5"}]
[null,457,{"$f":"VLOOKUP(Datenbereich_A5[[#This Row],[Spalte1]],AGS_Namen!$C$1:$D$58,2,FALSE)","v":"Leer"},{"v":3700,"d":" 3 700"},{"v":220,"d":"  220"},{"v":1215,"d":" 1 215"},{"v":30,"d":"  30"},{"v":760,"d":"  760"},{"v":150,"d":"  150"},{"v":30,"d":"  30"},{"v":20,"d":"  20"},{"v":800,"d":"  800"},{"v":470,"d":"  470"},{"v":5,"d":"  5"}]
[null,458,{"$f":"VLOOKUP(Datenbereich_A5[[#This Row],[Spalte1]],AGS_Namen!$C$1:$D$58,2,FALSE)","v":"Oldenburg"},{"v":2820,"d":" 2 820"},{"v":355,"d":"  355"},{"v":1435,"d":" 1 435"},{"v":40,"d":"  40"},{"v":460,"d":"  460"},{"v":65,"d":"  65"},{"v":10,"d":"  10"},{"v":25,"d":"  25"},{"v":260,"d":"  260"},{"v":160,"d":"  160"},{"v":10,"d":"  10"}]
[null,459,{"$f":"VLOOKUP(Datenbereich_A5[[#This Row],[Spalte1]],AGS_Namen!$C$1:$D$58,2,FALSE)","v":"Osnabrück"},{"v":4950,"d":" 4 950"},{"v":500,"d":"  500"},{"v":1200,"d":" 1 200"},{"v":80,"d":"  80"},{"v":1025,"d":" 1 025"},{"v":95,"d":"  95"},{"v":95,"d":"  95"},{"v":55,"d":"  55"},{"v":1215,"d":" 1 215"},{"v":675,"d":"  675"},{"v":10,"d":"  10"}]
[null,460,{"$f":"VLOOKUP(Datenbereich_A5[[#This Row],[Spalte1]],AGS_Namen!$C$1:$D$58,2,FALSE)","v":"Vechta"},{"v":4105,"d":" 4 105"},{"v":365,"d":"  365"},{"v":2115,"d":" 2 115"},{"v":35,"d":"  35"},{"v":960,"d":"  960"},{"v":55,"d":"  55"},{"v":30,"d":"  30"},{"v":60,"d":"  60"},{"v":300,"d":"  300"},{"v":175,"d":"  175"},{"v":10,"d":"  10"}]
[null,461,{"$f":"VLOOKUP(Datenbereich_A5[[#This Row],[Spalte1]],AGS_Namen!$C$1:$D$58,2,FALSE)","v":"Wesermarsch"},{"v":1590,"d":" 1 590"},{"v":180,"d":"  180"},{"v":455,"d":"  455"},{"v":10,"d":"  10"},{"v":210,"d":"  210"},{"v":100,"d":"  100"},{"v":5,"d":"  5"},{"v":10,"d":"  10"},{"v":345,"d":"  345"},{"v":275,"d":"  275"},{"v":0,"d":"  0"}]
[null,462,{"$f":"VLOOKUP(Datenbereich_A5[[#This Row],[Spalte1]],AGS_Namen!$C$1:$D$58,2,FALSE)","v":"Wittmund"},{"v":845,"d":"  845"},{"v":105,"d":"  105"},{"v":210,"d":"  210"},{"v":0,"d":"  0"},{"v":150,"d":"  150"},{"v":40,"d":"  40"},{"v":5,"d":"  5"},{"v":5,"d":"  5"},{"v":205,"d":"  205"},{"v":125,"d":"  125"},{"v":0,"d":"  0"}]
[null,4,{"$f":"VLOOKUP(Datenbereich_A5[[#This Row],[Spalte1]],AGS_Namen!$C$1:$D$58,2,FALSE)","v":"Stat. Region Weser-Ems"},{"v":57595,"d":" 57 595"},{"v":5600,"d":" 5 600"},{"v":22895,"d":" 22 895"},{"v":700,"d":"  700"},{"v":11745,"d":" 11 745"},{"v":1495,"d":" 1 495"},{"v":615,"d":"  615"},{"v":940,"d":"  940"},{"v":8055,"d":" 8 055"},{"v":5440,"d":" 5 440"},{"v":110,"d":"  110"}]
[null,0,{"$f":"VLOOKUP(Datenbereich_A5[[#This Row],[Spalte1]],AGS_Namen!$C$1:$D$58,2,FALSE)","v":"Niedersachsen"},{"v":196090,"d":" 196 090"},{"v":25080,"d":" 25 080"},{"v":72595,"d":" 72 595"},{"v":2565,"d":" 2 565"},{"v":37850,"d":" 37 850"},{"v":5430,"d":" 5 430"},{"v":1820,"d":" 1 820"},{"v":3670,"d":" 3 670"},{"v":26695,"d":" 26 695"},{"v":19055,"d":" 19 055"},{"v":1330,"d":" 1 330"}]
[]
[]
[null,null,"Quelle: Ausländerzentralregister"]
[]
[]
[null,null,"Karte A5-2: Anteil der Geflüchteten mit befristeter Aufenthaltserlaubnis und geduldeter Personen an allen Ausländerinnen und Ausländern am 31.12.2019 in Prozent"]
{"$rows_empty":79}
[null,null,{"$f":"Def","v":"Die Definition zu dem Indikator sowie methodische Hinweise finden Sie in der Tabelle Aktuelle Ergebnisse"}]
[null,null,"Link zur LSN-Online-Datenbank"]

{"sheet":"A7","index":11,"n_rows":111,"n_cols":11,"rows_kept":111,"merged":[[2,2,2,4],[5,2,5,10],[9,2,11,2],[9,3,10,3],[9,4,9,10],[11,3,11,10],[110,2,110,10]]}
[null,null,{"$f":"Kopf","v":"Migration und Teilhabe in Niedersachsen - Integrationsmonitoring 2020 - Regionalinformationen "}]
[]
[]
[]
[null,null,"Indikator A7: Ausländerinnen und Ausländer nach Altersgruppen "]
[null,null,"Tabelle A7-2: Ausländerinnen und Ausländer am 31.12.2019 nach Altersgruppen und Kreisen"]
[]
[]
[]
[null,null,"Kreisfreie Stadt\nLandkreis\n(Großstadt, Umland)\nStatistische Region\nLand","Ausländerinnen und Ausländer insgesamt","davon im Alter von … bis unter … Jahren"]
[{"$nulls":4},"0 - 6","6 - 15","15 - 20","20  - 40","40 - 65 ","65 - 80","80 und älter"]
[{"$nulls":3},"Anzahl"]
[null,"Spalte1","1","2","3","4","5","6","7","8","9"]
[null,{"v":101,"d":"  101"},{"$f":"VLOOKUP(Datentabelle_A7[[#This Row],[Spalte1]],AGS_Namen!$C$1:$D$58,2,FALSE)","v":"Braunschweig, Stadt"},{"v":31445,"d":" 31 445"},{"v":1420,"d":" 1 420"},{"v":1890,"d":" 1 890"},{"v":1140,"d":" 1 140"},{"v":14905,"d":" 14 905"},{"v":9450,"d":" 9 450"},{"v":2095,"d":" 2 095"},{"v":545,"d":"  545"}]
[null,{"v":102,"d":"  102"},{"$f":"VLOOKUP(Datentabelle_A7[[#This Row],[Spalte1]],AGS_Namen!$C$1:$D$58,2,FALSE)","v":"Salzgitter, Stadt"},{"v":20175,"d":" 20 175"},{"v":1760,"d":" 1 760"},{"v":2105,"d":" 2 105"},{"v":990,"d":"  990"},{"v":7635,"d":" 7 635"},{"v":5955,"d":" 5 955"},{"v":1400,"d":" 1 400"},{"v":330,"d":"  330"}]
[null,{"v":103,"d":"  103"},{"$f":"VLOOKUP(Datentabelle_A7[[#This Row],[Spalte1]],AGS_Namen!$C$1:$D$58,2,FALSE)","v":"Wolfsburg, Stadt"},{"v":20160,"d":" 20 160"},{"v":1210,"d":" 1 210"},{"v":1405,"d":" 1 405"},{"v":750,"d":"  750"},{"v":8650,"d":" 8 650"},{"v":6215,"d":" 6 215"},{"v":1610,"d":" 1 610"},{"v":315,"d":"  315"}]
[null,{"v":151,"d":"  151"},{"$f":"VLOOKUP(Datentabelle_A7[[#This Row],[Spalte1]],AGS_Namen!$C$1:$D$58,2,FALSE)","v":"Gifhorn"},{"v":12330,"d":" 12 330"},{"v":775,"d":"  775"},{"v":1050,"d":" 1 050"},{"v":590,"d":"  590"},{"v":4800,"d":" 4 800"},{"v":4125,"d":" 4 125"},{"v":795,"d":"  795"},{"v":195,"d":"  195"}]
[null,{"v":153,"d":"  153"},{"$f":"VLOOKUP(Datentabelle_A7[[#This Row],[Spalte1]],AGS_Namen!$C$1:$D$58,2,FALSE)","v":"Goslar"},{"v":14020,"d":" 14 020"},{"v":840,"d":"  840"},{"v":1045,"d":" 1 045"},{"v":815,"d":"  815"},{"v":6475,"d":" 6 475"},{"v":3640,"d":" 3 640"},{"v":1000,"d":" 1 000"},{"v":200,"d":"  200"}]
[null,{"v":154,"d":"  154"},{"$f":"VLOOKUP(Datentabelle_A7[[#This Row],[Spalte1]],AGS_Namen!$C$1:$D$58,2,FALSE)","v":"Helmstedt"},{"v":6535,"d":" 6 535"},{"v":445,"d":"  445"},{"v":585,"d":"  585"},{"v":315,"d":"  315"},{"v":2465,"d":" 2 465"},{"v":2215,"d":" 2 215"},{"v":415,"d":"  415"},{"v":95,"d":"  95"}]
[null,{"v":155,"d":"  155"},{"$f":"VLOOKUP(Datentabelle_A7[[#This Row],[Spalte1]],AGS_Namen!$C$1:$D$58,2,FALSE)","v":"Northeim"},{"v":9225,"d":" 9 225"},{"v":725,"d":"  725"},{"v":935,"d":"  935"},{"v":495,"d":"  495"},{"v":3435,"d":" 3 435"},{"v":2890,"d":" 2 890"},{"v":610,"d":"  610"},{"v":140,"d":"  140"}]
[null,{"v":157,"d":"  157"},{"$f":"VLOOKUP(Datentabelle_A7[[#This Row],[Spalte1]],AGS_Namen!$C$1:$D$58,2,FALSE)","v":"Peine"},{"v":11340,"d":" 11 340"},{"v":770,"d":"  770"},{"v":1180,"d":" 1 180"},{"v":590,"d":"  590"},{"v":4255,"d":" 4 255"},{"v":3790,"d":" 3 790"},{"v":625,"d":"  625"},{"v":135,"d":"  135"}]
[null,{"v":158,"d":"  158"},{"$f":"VLOOKUP(Datentabelle_A7[[#This Row],[Spalte1]],AGS_Namen!$C$1:$D$58,2,FALSE)","v":"Wolfenbüttel"},{"v":7675,"d":" 7 675"},{"v":505,"d":"  505"},{"v":730,"d":"  730"},{"v":410,"d":"  410"},{"v":2860,"d":" 2 860"},{"v":2560,"d":" 2 560"},{"v":490,"d":"  490"},{"v":115,"d":"  115"}]
[null,{"v":159,"d":"  159"},{"$f":"VLOOKUP(Datentabelle_A7[[#This Row],[Spalte1]],AGS_Namen!$C$1:$D$58,2,FALSE)","v":"Göttingen"},{"v":32090,"d":" 32 090"},{"v":1915,"d":" 1 915"},{"v":2630,"d":" 2 630"},{"v":1460,"d":" 1 460"},{"v":14500,"d":" 14 500"},{"v":8935,"d":" 8 935"},{"v":2090,"d":" 2 090"},{"v":560,"d":"  560"}]
[null,{"v":1,"d":"  1"},{"$f":"VLOOKUP(Datentabelle_A7[[#This Row],[Spalte1]],AGS_Namen!$C$1:$D$58,2,FALSE)","v":"Stat. Region Braunschweig"},{"v":165000,"d":" 165 000"},{"v":10365,"d":" 10 365"},{"v":13555,"d":" 13 555"},{"v":7555,"d":" 7 555"},{"v":69990,"d":" 69 990"},{"v":49775,"d":" 49 775"},{"v":11130,"d":" 11 130"},{"v":2635,"d":" 2 635"}]
[null,{"v":241,"d":"  241"},{"$f":"VLOOKUP(Datentabelle_A7[[#This Row],[Spalte1]],AGS_Namen!$C$1:$D$58,2,FALSE)","v":"Hannover, Region"},{"v":185310,"d":" 185 310"},{"v":9420,"d":" 9 420"},{"v":13810,"d":" 13 810"},{"v":7620,"d":" 7 620"},{"v":74710,"d":" 74 710"},{"v":60415,"d":" 60 415"},{"v":14690,"d":" 14 690"},{"v":4645,"d":" 4 645"}]
[null,{"v":241001,"d":" 241 001"},{"$f":"VLOOKUP(Datentabelle_A7[[#This Row],[Spalte1]],AGS_Namen!$C$1:$D$58,2,FALSE)","v":"   dav. Hannover, Lhst."},{"v":113440,"d":" 113 440"},{"v":4915,"d":" 4 915"},{"v":7330,"d":" 7 330"},{"v":4000,"d":" 4 000"},{"v":48280,"d":" 48 280"},{"v":36000,"d":" 36 000"},{"v":9595,"d":" 9 595"},{"v":3325,"d":" 3 325"}]
[null,{"v":241999,"d":" 241 999"},{"$f":"VLOOKUP(Datentabelle_A7[[#This Row],[Spalte1]],AGS_Namen!$C$1:$D$58,2,FALSE)","v":"   dav. Hannover, Umland"},{"v":71870,"d":" 71 870"},{"v":4505,"d":" 4 505"},{"v":6480,"d":" 6 480"},{"v":3620,"d":" 3 620"},{"v":26430,"d":" 26 430"},{"v":24415,"d":" 24 415"},{"v":5095,"d":" 5 095"},{"v":1320,"d":" 1 320"}]
[null,{"v":251,"d":"  251"},{"$f":"VLOOKUP(Datentabelle_A7[[#This Row],[Spalte1]],AGS_Namen!$C$1:$D$58,2,FALSE)","v":"Diepholz"},{"v":18545,"d":" 18 545"},{"v":1385,"d":" 1 385"},{"v":2015,"d":" 2 015"},{"v":1080,"d":" 1 080"},{"v":6815,"d":" 6 815"},{"v":6230,"d":" 6 230"},{"v":855,"d":"  855"},{"v":160,"d":"  160"}]
[null,{"v":252,"d":"  252"},{"$f":"VLOOKUP(Datentabelle_A7[[#This Row],[Spalte1]],AGS_Namen!$C$1:$D$58,2,FALSE)","v":"Hameln-Pyrmont"},{"v":16910,"d":" 16 910"},{"v":1300,"d":" 1 300"},{"v":1790,"d":" 1 790"},{"v":925,"d":"  925"},{"v":5700,"d":" 5 700"},{"v":5385,"d":" 5 385"},{"v":1450,"d":" 1 450"},{"v":360,"d":"  360"}]
[null,{"v":254,"d":"  254"},{"$f":"VLOOKUP(Datentabelle_A7[[#This Row],[Spalte1]],AGS_Namen!$C$1:$D$58,2,FALSE)","v":"Hildesheim"},{"v":24995,"d":" 24 995"},{"v":1610,"d":" 1 610"},{"v":2125,"d":" 2 125"},{"v":1370,"d":" 1 370"},{"v":10245,"d":" 10 245"},{"v":7475,"d":" 7 475"},{"v":1785,"d":" 1 785"},{"v":375,"d":"  375"}]
[null,{"v":255,"d":"  255"},{"$f":"VLOOKUP(Datentabelle_A7[[#This Row],[Spalte1]],AGS_Namen!$C$1:$D$58,2,FALSE)","v":"Holzminden"},{"v":4275,"d":" 4 275"},{"v":250,"d":"  250"},{"v":405,"d":"  405"},{"v":245,"d":"  245"},{"v":1460,"d":" 1 460"},{"v":1420,"d":" 1 420"},{"v":415,"d":"  415"},{"v":80,"d":"  80"}]
[null,{"v":256,"d":"  256"},{"$f":"VLOOKUP(Datentabelle_A7[[#This Row],[Spalte1]],AGS_Namen!$C$1:$D$58,2,FALSE)","v":"Nienburg (Weser)"},{"v":10345,"d":" 10 345"},{"v":805,"d":"  805"},{"v":1190,"d":" 1 190"},{"v":610,"d":"  610"},{"v":3715,"d":" 3 715"},{"v":3395,"d":" 3 395"},{"v":525,"d":"  525"},{"v":105,"d":"  105"}]
[null,{"v":257,"d":"  257"},{"$f":"VLOOKUP(Datentabelle_A7[[#This Row],[Spalte1]],AGS_Namen!$C$1:$D$58,2,FALSE)","v":"Schaumburg"},{"v":14255,"d":" 14 255"},{"v":965,"d":"  965"},{"v":1240,"d":" 1 240"},{"v":670,"d":"  670"},{"v":5135,"d":" 5 135"},{"v":4945,"d":" 4 945"},{"v":1050,"d":" 1 050"},{"v":245,"d":"  245"}]
[null,{"v":2,"d":"  2"},{"$f":"VLOOKUP(Datentabelle_A7[[#This Row],[Spalte1]],AGS_Namen!$C$1:$D$58,2,FALSE)","v":"Stat. Region Hannover"},{"v":274635,"d":" 274 635"},{"v":15735,"d":" 15 735"},{"v":22575,"d":" 22 575"},{"v":12530,"d":" 12 530"},{"v":107780,"d":" 107 780"},{"v":89265,"d":" 89 265"},{"v":20775,"d":" 20 775"},{"v":5980,"d":" 5 980"}]
[null,{"v":351,"d":"  351"},{"$f":"VLOOKUP(Datentabelle_A7[[#This Row],[Spalte1]],AGS_Namen!$C$1:$D$58,2,FALSE)","v":"Celle"},{"v":14330,"d":" 14 330"},{"v":1030,"d":" 1 030"},{"v":1535,"d":" 1 535"},{"v":885,"d":"  885"},{"v":5180,"d":" 5 180"},{"v":4550,"d":" 4 550"},{"v":925,"d":"  925"},{"v":225,"d":"  225"}]
[null,{"v":352,"d":"  352"},{"$f":"VLOOKUP(Datentabelle_A7[[#This Row],[Spalte1]],AGS_Namen!$C$1:$D$58,2,FALSE)","v":"Cuxhaven"},{"v":13345,"d":" 13 345"},{"v":875,"d":"  875"},{"v":1285,"d":" 1 285"},{"v":710,"d":"  710"},{"v":4740,"d":" 4 740"},{"v":4620,"d":" 4 620"},{"v":930,"d":"  930"},{"v":180,"d":"  180"}]
[null,{"v":353,"d":"  353"},{"$f":"VLOOKUP(Datentabelle_A7[[#This Row],[Spalte1]],AGS_Namen!$C$1:$D$58,2,FALSE)","v":"Harburg"},{"v":21285,"d":" 21 285"},{"v":905,"d":"  905"},{"v":1405,"d":" 1 405"},{"v":875,"d":"  875"},{"v":9105,"d":" 9 105"},{"v":7440,"d":" 7 440"},{"v":1285,"d":" 1 285"},{"v":265,"d":"  265"}]
[null,{"v":354,"d":"  354"},{"$f":"VLOOKUP(Datentabelle_A7[[#This Row],[Spalte1]],AGS_Namen!$C$1:$D$58,2,FALSE)","v":"Lüchow-Dannenberg"},{"v":2785,"d":" 2 785"},{"v":230,"d":"  230"},{"v":265,"d":"  265"},{"v":170,"d":"  170"},{"v":1025,"d":" 1 025"},{"v":920,"d":"  920"},{"v":160,"d":"  160"},{"v":15,"d":"  15"}]
[null,{"v":355,"d":"  355"},{"$f":"VLOOKUP(Datentabelle_A7[[#This Row],[Spalte1]],AGS_Namen!$C$1:$D$58,2,FALSE)","v":"Lüneburg"},{"v":13120,"d":" 13 120"},{"v":845,"d":"  845"},{"v":1335,"d":" 1 335"},{"v":780,"d":"  780"},{"v":5370,"d":" 5 370"},{"v":4005,"d":" 4 005"},{"v":675,"d":"  675"},{"v":110,"d":"  110"}]
[null,{"v":356,"d":"  356"},{"$f":"VLOOKUP(Datentabelle_A7[[#This Row],[Spalte1]],AGS_Namen!$C$1:$D$58,2,FALSE)","v":"Osterholz"},{"v":6715,"d":" 6 715"},{"v":515,"d":"  515"},{"v":750,"d":"  750"},{"v":380,"d":"  380"},{"v":2330,"d":" 2 330"},{"v":2270,"d":" 2 270"},{"v":395,"d":"  395"},{"v":70,"d":"  70"}]
[null,{"v":357,"d":"  357"},{"$f":"VLOOKUP(Datentabelle_A7[[#This Row],[Spalte1]],AGS_Namen!$C$1:$D$58,2,FALSE)","v":"Rotenburg (Wümme)"},{"v":11585,"d":" 11 585"},{"v":760,"d":"  760"},{"v":1030,"d":" 1 030"},{"v":665,"d":"  665"},{"v":4385,"d":" 4 385"},{"v":3995,"d":" 3 995"},{"v":645,"d":"  645"},{"v":105,"d":"  105"}]
[null,{"v":358,"d":"  358"},{"$f":"VLOOKUP(Datentabelle_A7[[#This Row],[Spalte1]],AGS_Namen!$C$1:$D$58,2,FALSE)","v":"Heidekreis"},{"v":12525,"d":" 12 525"},{"v":925,"d":"  925"},{"v":1100,"d":" 1 100"},{"v":635,"d":"  635"},{"v":5045,"d":" 5 045"},{"v":3975,"d":" 3 975"},{"v":685,"d":"  685"},{"v":155,"d":"  155"}]
[null,{"v":359,"d":"  359"},{"$f":"VLOOKUP(Datentabelle_A7[[#This Row],[Spalte1]],AGS_Namen!$C$1:$D$58,2,FALSE)","v":"Stade"},{"v":19385,"d":" 19 385"},{"v":1425,"d":" 1 425"},{"v":1885,"d":" 1 885"},{"v":1030,"d":" 1 030"},{"v":7795,"d":" 7 795"},{"v":6195,"d":" 6 195"},{"v":895,"d":"  895"},{"v":160,"d":"  160"}]
[null,{"v":360,"d":"  360"},{"$f":"VLOOKUP(Datentabelle_A7[[#This Row],[Spalte1]],AGS_Namen!$C$1:$D$58,2,FALSE)","v":"Uelzen"},{"v":5765,"d":" 5 765"},{"v":405,"d":"  405"},{"v":635,"d":"  635"},{"v":315,"d":"  315"},{"v":2190,"d":" 2 190"},{"v":1865,"d":" 1 865"},{"v":305,"d":"  305"},{"v":55,"d":"  55"}]
[null,{"v":361,"d":"  361"},{"$f":"VLOOKUP(Datentabelle_A7[[#This Row],[Spalte1]],AGS_Namen!$C$1:$D$58,2,FALSE)","v":"Verden"},{"v":11175,"d":" 11 175"},{"v":690,"d":"  690"},{"v":1010,"d":" 1 010"},{"v":550,"d":"  550"},{"v":4505,"d":" 4 505"},{"v":3650,"d":" 3 650"},{"v":640,"d":"  640"},{"v":140,"d":"  140"}]
[null,{"v":3,"d":"  3"},{"$f":"VLOOKUP(Datentabelle_A7[[#This Row],[Spalte1]],AGS_Namen!$C$1:$D$58,2,FALSE)","v":"Stat. Region Lüneburg"},{"v":132025,"d":" 132 025"},{"v":8605,"d":" 8 605"},{"v":12235,"d":" 12 235"},{"v":6995,"d":" 6 995"},{"v":51675,"d":" 51 675"},{"v":43485,"d":" 43 485"},{"v":7545,"d":" 7 545"},{"v":1485,"d":" 1 485"}]
[null,{"v":401,"d":"  401"},{"$f":"VLOOKUP(Datentabelle_A7[[#This Row],[Spalte1]],AGS_Namen!$C$1:$D$58,2,FALSE)","v":"Delmenhorst, Stadt"},{"v":13220,"d":" 13 220"},{"v":1120,"d":" 1 120"},{"v":1445,"d":" 1 445"},{"v":695,"d":"  695"},{"v":4955,"d":" 4 955"},{"v":4010,"d":" 4 010"},{"v":830,"d":"  830"},{"v":160,"d":"  160"}]
[null,{"v":402,"d":"  402"},{"$f":"VLOOKUP(Datentabelle_A7[[#This Row],[Spalte1]],AGS_Namen!$C$1:$D$58,2,FALSE)","v":"Emden, Stadt"},{"v":5675,"d":" 5 675"},{"v":475,"d":"  475"},{"v":615,"d":"  615"},{"v":300,"d":"  300"},{"v":2470,"d":" 2 470"},{"v":1545,"d":" 1 545"},{"v":225,"d":"  225"},{"v":45,"d":"  45"}]
[null,{"v":403,"d":"  403"},{"$f":"VLOOKUP(Datentabelle_A7[[#This Row],[Spalte1]],AGS_Namen!$C$1:$D$58,2,FALSE)","v":"Oldenburg (Oldb), Stadt"},{"v":18285,"d":" 18 285"},{"v":1365,"d":" 1 365"},{"v":1805,"d":" 1 805"},{"v":950,"d":"  950"},{"v":8200,"d":" 8 200"},{"v":4935,"d":" 4 935"},{"v":875,"d":"  875"},{"v":155,"d":"  155"}]
[null,{"v":404,"d":"  404"},{"$f":"VLOOKUP(Datentabelle_A7[[#This Row],[Spalte1]],AGS_Namen!$C$1:$D$58,2,FALSE)","v":"Osnabrück, Stadt"},{"v":25290,"d":" 25 290"},{"v":1535,"d":" 1 535"},{"v":1970,"d":" 1 970"},{"v":1145,"d":" 1 145"},{"v":11050,"d":" 11 050"},{"v":7555,"d":" 7 555"},{"v":1630,"d":" 1 630"},{"v":405,"d":"  405"}]
[null,{"v":405,"d":"  405"},{"$f":"VLOOKUP(Datentabelle_A7[[#This Row],[Spalte1]],AGS_Namen!$C$1:$D$58,2,FALSE)","v":"Wilhelmshaven, Stadt"},{"v":8785,"d":" 8 785"},{"v":855,"d":"  855"},{"v":975,"d":"  975"},{"v":455,"d":"  455"},{"v":3705,"d":" 3 705"},{"v":2265,"d":" 2 265"},{"v":450,"d":"  450"},{"v":80,"d":"  80"}]
[null,{"v":451,"d":"  451"},{"$f":"VLOOKUP(Datentabelle_A7[[#This Row],[Spalte1]],AGS_Namen!$C$1:$D$58,2,FALSE)","v":"Ammerland"},{"v":8525,"d":" 8 525"},{"v":605,"d":"  605"},{"v":935,"d":"  935"},{"v":470,"d":"  470"},{"v":3350,"d":" 3 350"},{"v":2710,"d":" 2 710"},{"v":385,"d":"  385"},{"v":70,"d":"  70"}]
[null,{"v":452,"d":"  452"},{"$f":"VLOOKUP(Datentabelle_A7[[#This Row],[Spalte1]],AGS_Namen!$C$1:$D$58,2,FALSE)","v":"Aurich"},{"v":11480,"d":" 11 480"},{"v":795,"d":"  795"},{"v":1145,"d":" 1 145"},{"v":635,"d":"  635"},{"v":4815,"d":" 4 815"},{"v":3450,"d":" 3 450"},{"v":555,"d":"  555"},{"v":80,"d":"  80"}]
[null,{"v":453,"d":"  453"},{"$f":"VLOOKUP(Datentabelle_A7[[#This Row],[Spalte1]],AGS_Namen!$C$1:$D$58,2,FALSE)","v":"Cloppenburg"},{"v":18890,"d":" 18 890"},{"v":1515,"d":" 1 515"},{"v":1760,"d":" 1 760"},{"v":900,"d":"  900"},{"v":7955,"d":" 7 955"},{"v":6185,"d":" 6 185"},{"v":495,"d":"  495"},{"v":80,"d":"  80"}]
[null,{"v":454,"d":"  454"},{"$f":"VLOOKUP(Datentabelle_A7[[#This Row],[Spalte1]],AGS_Namen!$C$1:$D$58,2,FALSE)","v":"Emsland"},{"v":40430,"d":" 40 430"},{"v":2690,"d":" 2 690"},{"v":3555,"d":" 3 555"},{"v":1985,"d":" 1 985"},{"v":16135,"d":" 16 135"},{"v":13605,"d":" 13 605"},{"v":2180,"d":" 2 180"},{"v":275,"d":"  275"}]
[null,{"v":455,"d":"  455"},{"$f":"VLOOKUP(Datentabelle_A7[[#This Row],[Spalte1]],AGS_Namen!$C$1:$D$58,2,FALSE)","v":"Friesland"},{"v":4840,"d":" 4 840"},{"v":440,"d":"  440"},{"v":575,"d":"  575"},{"v":290,"d":"  290"},{"v":1655,"d":" 1 655"},{"v":1500,"d":" 1 500"},{"v":300,"d":"  300"},{"v":80,"d":"  80"}]
[null,{"v":456,"d":"  456"},{"$f":"VLOOKUP(Datentabelle_A7[[#This Row],[Spalte1]],AGS_Namen!$C$1:$D$58,2,FALSE)","v":"Grafschaft Bentheim"},{"v":22030,"d":" 22 030"},{"v":1130,"d":" 1 130"},{"v":1900,"d":" 1 900"},{"v":1035,"d":" 1 035"},{"v":6350,"d":" 6 350"},{"v":8170,"d":" 8 170"},{"v":2905,"d":" 2 905"},{"v":540,"d":"  540"}]
[null,{"v":457,"d":"  457"},{"$f":"VLOOKUP(Datentabelle_A7[[#This Row],[Spalte1]],AGS_Namen!$C$1:$D$58,2,FALSE)","v":"Leer"},{"v":14855,"d":" 14 855"},{"v":1255,"d":" 1 255"},{"v":1535,"d":" 1 535"},{"v":785,"d":"  785"},{"v":5400,"d":" 5 400"},{"v":4730,"d":" 4 730"},{"v":1020,"d":" 1 020"},{"v":130,"d":"  130"}]
[null,{"v":458,"d":"  458"},{"$f":"VLOOKUP(Datentabelle_A7[[#This Row],[Spalte1]],AGS_Namen!$C$1:$D$58,2,FALSE)","v":"Oldenburg"},{"v":12525,"d":" 12 525"},{"v":770,"d":"  770"},{"v":1240,"d":" 1 240"},{"v":710,"d":"  710"},{"v":4945,"d":" 4 945"},{"v":4380,"d":" 4 380"},{"v":390,"d":"  390"},{"v":90,"d":"  90"}]
[null,{"v":459,"d":"  459"},{"$f":"VLOOKUP(Datentabelle_A7[[#This Row],[Spalte1]],AGS_Namen!$C$1:$D$58,2,FALSE)","v":"Osnabrück"},{"v":33445,"d":" 33 445"},{"v":2240,"d":" 2 240"},{"v":2810,"d":" 2 810"},{"v":1560,"d":" 1 560"},{"v":13080,"d":" 13 080"},{"v":11595,"d":" 11 595"},{"v":1815,"d":" 1 815"},{"v":340,"d":"  340"}]
[null,{"v":460,"d":"  460"},{"$f":"VLOOKUP(Datentabelle_A7[[#This Row],[Spalte1]],AGS_Namen!$C$1:$D$58,2,FALSE)","v":"Vechta"},{"v":20715,"d":" 20 715"},{"v":1595,"d":" 1 595"},{"v":2065,"d":" 2 065"},{"v":1075,"d":" 1 075"},{"v":8590,"d":" 8 590"},{"v":6625,"d":" 6 625"},{"v":630,"d":"  630"},{"v":135,"d":"  135"}]
[null,{"v":461,"d":"  461"},{"$f":"VLOOKUP(Datentabelle_A7[[#This Row],[Spalte1]],AGS_Namen!$C$1:$D$58,2,FALSE)","v":"Wesermarsch"},{"v":7780,"d":" 7 780"},{"v":550,"d":"  550"},{"v":760,"d":"  760"},{"v":380,"d":"  380"},{"v":2750,"d":" 2 750"},{"v":2700,"d":" 2 700"},{"v":520,"d":"  520"},{"v":120,"d":"  120"}]
[null,{"v":462,"d":"  462"},{"$f":"VLOOKUP(Datentabelle_A7[[#This Row],[Spalte1]],AGS_Namen!$C$1:$D$58,2,FALSE)","v":"Wittmund"},{"v":2745,"d":" 2 745"},{"v":205,"d":"  205"},{"v":305,"d":"  305"},{"v":185,"d":"  185"},{"v":1055,"d":" 1 055"},{"v":840,"d":"  840"},{"v":130,"d":"  130"},{"v":25,"d":"  25"}]
[null,{"v":4,"d":"  4"},{"$f":"VLOOKUP(Datentabelle_A7[[#This Row],[Spalte1]],AGS_Namen!$C$1:$D$58,2,FALSE)","v":"Stat. Region Weser-Ems"},{"v":269505,"d":" 269 505"},{"v":19145,"d":" 19 145"},{"v":25395,"d":" 25 395"},{"v":13560,"d":" 13 560"},{"v":106455,"d":" 106 455"},{"v":86805,"d":" 86 805"},{"v":15340,"d":" 15 340"},{"v":2805,"d":" 2 805"}]
[null,{"v":0,"d":"  0"},{"$f":"VLOOKUP(Datentabelle_A7[[#This Row],[Spalte1]],AGS_Namen!$C$1:$D$58,2,FALSE)","v":"Niedersachsen"},{"v":841165,"d":" 841 165"},{"v":53850,"d":" 53 850"},{"v":73760,"d":" 73 760"},{"v":40635,"d":" 40 635"},{"v":335900,"d":" 335 900"},{"v":269330,"d":" 269 330"},{"v":54790,"d":" 54 790"},{"v":12900,"d":" 12 900"}]
[]
[null,null,"Quelle: Ausländerzentralregister"]
[]
[null,null,"Karte A7-2: Anteil der Ausländerinnen und Ausländer im Alter bis unter 6 Jahren an der entsprechenden Altersgruppe der Gesamtbevölkerung am 31.12.2019 in Prozent"]
{"$rows_empty":40}
[null,null,{"$f":"Def","v":"Die Definition zu dem Indikator sowie methodische Hinweise finden Sie in der Tabelle Aktuelle Ergebnisse"}]
[null,null,"Link zur LSN-Online-Datenbank"]

{"sheet":"A9","index":12,"n_rows":114,"n_cols":14,"rows_kept":114,"merged":[[2,2,2,4],[5,2,5,10],[9,1,12,1],[9,2,12,2],[9,3,11,3],[9,4,9,13],[10,4,11,4],[10,5,11,5],[10,6,11,6],[10,7,10,9],[10,10,11,10],[10,11,11,11],[10,12,11,12],[10,13,11,13],[12,3,12,13],[67,2,67,12],[71,2,71,12],[113,2,113,10]]}
[null,null,{"$f":"Kopf","v":"Migration und Teilhabe in Niedersachsen - Integrationsmonitoring 2020 - Regionalinformationen "}]
[]
[]
[]
[null,null,"Indikator A9: Ausländerinnen und Ausländer nach Aufenthaltsstatus"]
[null,null,"Tabelle A9-2: Ausländerinnen und Ausländer am 31.12.2019 nach Aufenhaltsstatus und Kreisen"]
[]
[]
[]
[null,"AGS","Kreisfreie Stadt\nLandkreis\n(Großstadt, Umland)\nStatistische Region\nLand","Ausländerinnen und Ausländer insgesamt","dar. nach Aufenthaltsstatus"]
[{"$nulls":4},"Aufenthaltsstatus nach altem Recht \n(Ausländergesetz 1990)","Aufenthalts-\nerlaubnis","Niederlassungs-\nerlaubnis (inkl. Daueraufenthalt-EG)","Aufenthaltsrecht EU1)",null,null,"Antrag auf Aufenthaltstitel (AT) gestellt, von Erfordernis auf AT befreit, heimatlose Ausländer","Duldung","Aufenthalts- gestattung","Keinen Aufenthalts-\ntitel"]
[{"$nulls":8},"dav. Aufenthalts-\nerlaubnis EU ","dav. EU-Bürgerinnen und Bürger ohne erfassten Aufenthaltsstatus"]
[{"$nulls":3},"Anzahl"]
[null,"Spalte1","1","2","3","4","5","6","7","8","9","10","11","12"]
[null,101,"Braunschweig, Stadt",{"v":31445,"d":"31 445"},{"v":860,"d":" 860"},{"v":8280,"d":"8 280"},{"v":7895,"d":"7 895"},{"v":8915,"d":"8 915"},{"v":1485,"d":"1 485"},{"v":7430,"d":"7 430"},{"v":935,"d":" 935"},{"v":480,"d":" 480"},{"v":1585,"d":"1 585"},{"v":1785,"d":"1 785"}]
[null,102,"Salzgitter, Stadt",{"v":20175,"d":"20 175"},{"v":375,"d":" 375"},{"v":6905,"d":"6 905"},{"v":5300,"d":"5 300"},{"v":5900,"d":"5 900"},{"v":690,"d":" 690"},{"v":5210,"d":"5 210"},{"v":335,"d":" 335"},{"v":225,"d":" 225"},{"v":255,"d":" 255"},{"v":375,"d":" 375"}]
[null,103,"Wolfsburg, Stadt",{"v":20160,"d":"20 160"},{"v":335,"d":" 335"},{"v":5260,"d":"5 260"},{"v":2595,"d":"2 595"},{"v":9600,"d":"9 600"},{"v":3710,"d":"3 710"},{"v":5890,"d":"5 890"},{"v":455,"d":" 455"},{"v":385,"d":" 385"},{"v":505,"d":" 505"},{"v":490,"d":" 490"}]
[null,151,"Gifhorn",{"v":12330,"d":"12 330"},{"v":505,"d":" 505"},{"v":2855,"d":"2 855"},{"v":2480,"d":"2 480"},{"v":4105,"d":"4 105"},{"v":1080,"d":"1 080"},{"v":3025,"d":"3 025"},{"v":370,"d":" 370"},{"v":405,"d":" 405"},{"v":815,"d":" 815"},{"v":530,"d":" 530"}]
[null,159,"Göttingen",{"v":32090,"d":"32 090"},{"v":745,"d":" 745"},{"v":9770,"d":"9 770"},{"v":5935,"d":"5 935"},{"v":8735,"d":"8 735"},{"v":1670,"d":"1 670"},{"v":7065,"d":"7 065"},{"v":1690,"d":"1 690"},{"v":1110,"d":"1 110"},{"v":1040,"d":"1 040"},{"v":2310,"d":"2 310"}]
[null,153,"Goslar",{"v":14020,"d":"14 020"},{"v":130,"d":" 130"},{"v":5455,"d":"5 455"},{"v":2470,"d":"2 470"},{"v":3685,"d":"3 685"},{"v":810,"d":" 810"},{"v":2875,"d":"2 875"},{"v":425,"d":" 425"},{"v":345,"d":" 345"},{"v":260,"d":" 260"},{"v":860,"d":" 860"}]
[null,154,"Helmstedt",{"v":6535,"d":"6 535"},{"v":95,"d":" 95"},{"v":1560,"d":"1 560"},{"v":1360,"d":"1 360"},{"v":2665,"d":"2 665"},{"v":395,"d":" 395"},{"v":2270,"d":"2 270"},{"v":95,"d":" 95"},{"v":270,"d":" 270"},{"v":245,"d":" 245"},{"v":135,"d":" 135"}]
[null,155,"Northeim",{"v":9225,"d":"9 225"},{"v":190,"d":" 190"},{"v":2625,"d":"2 625"},{"v":1615,"d":"1 615"},{"v":3015,"d":"3 015"},{"v":700,"d":" 700"},{"v":2310,"d":"2 310"},{"v":510,"d":" 510"},{"v":305,"d":" 305"},{"v":355,"d":" 355"},{"v":445,"d":" 445"}]
[null,157,"Peine",{"v":11340,"d":"11 340"},{"v":155,"d":" 155"},{"v":3660,"d":"3 660"},{"v":2795,"d":"2 795"},{"v":3660,"d":"3 660"},{"v":260,"d":" 260"},{"v":3400,"d":"3 400"},{"v":65,"d":" 65"},{"v":280,"d":" 280"},{"v":380,"d":" 380"},{"v":105,"d":" 105"}]
[null,158,"Wolfenbüttel",{"v":7675,"d":"7 675"},{"v":290,"d":" 290"},{"v":2395,"d":"2 395"},{"v":1540,"d":"1 540"},{"v":2150,"d":"2 150"},{"v":430,"d":" 430"},{"v":1715,"d":"1 715"},{"v":185,"d":" 185"},{"v":370,"d":" 370"},{"v":310,"d":" 310"},{"v":285,"d":" 285"}]
[null,{"v":1,"d":" 1"},"Stat. Region Braunschweig",{"v":165000,"d":"165 000"},{"v":3675,"d":"3 675"},{"v":48765,"d":"48 765"},{"v":33990,"d":"33 990"},{"v":52430,"d":"52 430"},{"v":11235,"d":"11 235"},{"v":41195,"d":"41 195"},{"v":5070,"d":"5 070"},{"v":4165,"d":"4 165"},{"v":5750,"d":"5 750"},{"v":7320,"d":"7 320"}]
[null,241,"Hannover, Region",{"v":185310,"d":"185 310"},{"v":5775,"d":"5 775"},{"v":48050,"d":"48 050"},{"v":48105,"d":"48 105"},{"v":60270,"d":"60 270"},{"v":14285,"d":"14 285"},{"v":45990,"d":"45 990"},{"v":7070,"d":"7 070"},{"v":2845,"d":"2 845"},{"v":3905,"d":"3 905"},{"v":5190,"d":"5 190"}]
[null,241001,"   dav. Hannover, Lhst.",{"v":113440,"d":"113 440"},{"v":2995,"d":"2 995"},{"v":28635,"d":"28 635"},{"v":31720,"d":"31 720"},{"v":36035,"d":"36 035"},{"v":8845,"d":"8 845"},{"v":27190,"d":"27 190"},{"v":4975,"d":"4 975"},{"v":1365,"d":"1 365"},{"v":1820,"d":"1 820"},{"v":3460,"d":"3 460"}]
[null,241999,"   dav. Hannover, Umland",{"v":71875,"d":"71 875"},{"v":2780,"d":"2 780"},{"v":19415,"d":"19 415"},{"v":16385,"d":"16 385"},{"v":24235,"d":"24 235"},{"v":5440,"d":"5 440"},{"v":18795,"d":"18 795"},{"v":2095,"d":"2 095"},{"v":1480,"d":"1 480"},{"v":2085,"d":"2 085"},{"v":1730,"d":"1 730"}]
[null,251,"Diepholz",{"v":18545,"d":"18 545"},{"v":420,"d":" 420"},{"v":4500,"d":"4 500"},{"v":2915,"d":"2 915"},{"v":8045,"d":"8 045"},{"v":750,"d":" 750"},{"v":7295,"d":"7 295"},{"v":385,"d":" 385"},{"v":625,"d":" 625"},{"v":935,"d":" 935"},{"v":385,"d":" 385"}]
[null,252,"Hameln-Pyrmont",{"v":16910,"d":"16 910"},{"v":265,"d":" 265"},{"v":5030,"d":"5 030"},{"v":4570,"d":"4 570"},{"v":5145,"d":"5 145"},{"v":1160,"d":"1 160"},{"v":3985,"d":"3 985"},{"v":275,"d":" 275"},{"v":450,"d":" 450"},{"v":460,"d":" 460"},{"v":325,"d":" 325"}]
[null,254,"Hildesheim",{"v":24995,"d":"24 995"},{"v":555,"d":" 555"},{"v":6855,"d":"6 855"},{"v":5285,"d":"5 285"},{"v":8075,"d":"8 075"},{"v":1570,"d":"1 570"},{"v":6500,"d":"6 500"},{"v":1270,"d":"1 270"},{"v":645,"d":" 645"},{"v":1000,"d":"1 000"},{"v":800,"d":" 800"}]
[null,255,"Holzminden",{"v":4275,"d":"4 275"},{"v":120,"d":" 120"},{"v":1305,"d":"1 305"},{"v":1500,"d":"1 500"},{"v":615,"d":" 615"},{"v":210,"d":" 210"},{"v":405,"d":" 405"},{"v":70,"d":" 70"},{"v":100,"d":" 100"},{"v":230,"d":" 230"},{"v":160,"d":" 160"}]
[null,256,"Nienburg (Weser)",{"v":10345,"d":"10 345"},{"v":160,"d":" 160"},{"v":3065,"d":"3 065"},{"v":1775,"d":"1 775"},{"v":4015,"d":"4 015"},{"v":460,"d":" 460"},{"v":3550,"d":"3 550"},{"v":245,"d":" 245"},{"v":295,"d":" 295"},{"v":415,"d":" 415"},{"v":140,"d":" 140"}]
[null,257,"Schaumburg",{"v":14255,"d":"14 255"},{"v":245,"d":" 245"},{"v":3850,"d":"3 850"},{"v":3130,"d":"3 130"},{"v":4930,"d":"4 930"},{"v":965,"d":" 965"},{"v":3965,"d":"3 965"},{"v":345,"d":" 345"},{"v":530,"d":" 530"},{"v":715,"d":" 715"},{"v":255,"d":" 255"}]
[null,{"v":2,"d":" 2"},"Stat. Region Hannover",{"v":274635,"d":"274 635"},{"v":7535,"d":"7 535"},{"v":72655,"d":"72 655"},{"v":67280,"d":"67 280"},{"v":91100,"d":"91 100"},{"v":19400,"d":"19 400"},{"v":71700,"d":"71 700"},{"v":9660,"d":"9 660"},{"v":5490,"d":"5 490"},{"v":7660,"d":"7 660"},{"v":7255,"d":"7 255"}]
[null,351,"Celle",{"v":14330,"d":"14 330"},{"v":160,"d":" 160"},{"v":4740,"d":"4 740"},{"v":2360,"d":"2 360"},{"v":5290,"d":"5 290"},{"v":945,"d":" 945"},{"v":4345,"d":"4 345"},{"v":305,"d":" 305"},{"v":375,"d":" 375"},{"v":325,"d":" 325"},{"v":340,"d":" 340"}]
[null,352,"Cuxhaven",{"v":13345,"d":"13 345"},{"v":385,"d":" 385"},{"v":3450,"d":"3 450"},{"v":1970,"d":"1 970"},{"v":5780,"d":"5 780"},{"v":860,"d":" 860"},{"v":4920,"d":"4 920"},{"v":385,"d":" 385"},{"v":385,"d":" 385"},{"v":525,"d":" 525"},{"v":245,"d":" 245"}]
[null,353,"Harburg",{"v":21285,"d":"21 285"},{"v":725,"d":" 725"},{"v":4120,"d":"4 120"},{"v":3780,"d":"3 780"},{"v":8570,"d":"8 570"},{"v":1495,"d":"1 495"},{"v":7075,"d":"7 075"},{"v":855,"d":" 855"},{"v":975,"d":" 975"},{"v":835,"d":" 835"},{"v":790,"d":" 790"}]
[null,354,"Lüchow-Dannenberg",{"v":2785,"d":"2 785"},{"v":60,"d":" 60"},{"v":690,"d":" 690"},{"v":340,"d":" 340"},{"v":1265,"d":"1 265"},{"v":125,"d":" 125"},{"v":1145,"d":"1 145"},{"v":65,"d":" 65"},{"v":85,"d":" 85"},{"v":120,"d":" 120"},{"v":115,"d":" 115"}]
[null,355,"Lüneburg",{"v":13120,"d":"13 120"},{"v":185,"d":" 185"},{"v":4650,"d":"4 650"},{"v":1995,"d":"1 995"},{"v":4090,"d":"4 090"},{"v":505,"d":" 505"},{"v":3585,"d":"3 585"},{"v":680,"d":" 680"},{"v":400,"d":" 400"},{"v":425,"d":" 425"},{"v":250,"d":" 250"}]
[null,356,"Osterholz",{"v":6715,"d":"6 715"},{"v":195,"d":" 195"},{"v":2110,"d":"2 110"},{"v":1390,"d":"1 390"},{"v":2130,"d":"2 130"},{"v":390,"d":" 390"},{"v":1740,"d":"1 740"},{"v":100,"d":" 100"},{"v":195,"d":" 195"},{"v":275,"d":" 275"},{"v":135,"d":" 135"}]
[null,357,"Rotenburg (Wümme)",{"v":11585,"d":"11 585"},{"v":225,"d":" 225"},{"v":2705,"d":"2 705"},{"v":1780,"d":"1 780"},{"v":5095,"d":"5 095"},{"v":855,"d":" 855"},{"v":4240,"d":"4 240"},{"v":250,"d":" 250"},{"v":335,"d":" 335"},{"v":580,"d":" 580"},{"v":355,"d":" 355"}]
[null,358,"Heidekreis",{"v":12525,"d":"12 525"},{"v":265,"d":" 265"},{"v":2940,"d":"2 940"},{"v":1830,"d":"1 830"},{"v":5675,"d":"5 675"},{"v":850,"d":" 850"},{"v":4825,"d":"4 825"},{"v":215,"d":" 215"},{"v":265,"d":" 265"},{"v":495,"d":" 495"},{"v":705,"d":" 705"}]
[null,359,"Stade",{"v":19385,"d":"19 385"},{"v":345,"d":" 345"},{"v":4940,"d":"4 940"},{"v":2605,"d":"2 605"},{"v":8930,"d":"8 930"},{"v":1090,"d":"1 090"},{"v":7840,"d":"7 840"},{"v":405,"d":" 405"},{"v":555,"d":" 555"},{"v":910,"d":" 910"},{"v":300,"d":" 300"}]
[null,360,"Uelzen",{"v":5765,"d":"5 765"},{"v":85,"d":" 85"},{"v":1745,"d":"1 745"},{"v":915,"d":" 915"},{"v":2175,"d":"2 175"},{"v":305,"d":" 305"},{"v":1865,"d":"1 865"},{"v":205,"d":" 205"},{"v":150,"d":" 150"},{"v":180,"d":" 180"},{"v":120,"d":" 120"}]
[null,361,"Verden",{"v":11175,"d":"11 175"},{"v":430,"d":" 430"},{"v":3305,"d":"3 305"},{"v":2590,"d":"2 590"},{"v":3320,"d":"3 320"},{"v":495,"d":" 495"},{"v":2825,"d":"2 825"},{"v":225,"d":" 225"},{"v":240,"d":" 240"},{"v":565,"d":" 565"},{"v":195,"d":" 195"}]
[null,{"v":3,"d":" 3"},"Stat. Region Lüneburg",{"v":132025,"d":"132 025"},{"v":3070,"d":"3 070"},{"v":35390,"d":"35 390"},{"v":21555,"d":"21 555"},{"v":52320,"d":"52 320"},{"v":7915,"d":"7 915"},{"v":44405,"d":"44 405"},{"v":3695,"d":"3 695"},{"v":3955,"d":"3 955"},{"v":5235,"d":"5 235"},{"v":3550,"d":"3 550"}]
[null,401,"Delmenhorst, Stadt",{"v":13220,"d":"13 220"},{"v":315,"d":" 315"},{"v":3800,"d":"3 800"},{"v":2990,"d":"2 990"},{"v":4960,"d":"4 960"},{"v":440,"d":" 440"},{"v":4520,"d":"4 520"},{"v":275,"d":" 275"},{"v":155,"d":" 155"},{"v":265,"d":" 265"},{"v":145,"d":" 145"}]
[null,402,"Emden, Stadt",{"v":5675,"d":"5 675"},{"v":65,"d":" 65"},{"v":1845,"d":"1 845"},{"v":585,"d":" 585"},{"v":2400,"d":"2 400"},{"v":290,"d":" 290"},{"v":2105,"d":"2 105"},{"v":120,"d":" 120"},{"v":115,"d":" 115"},{"v":145,"d":" 145"},{"v":265,"d":" 265"}]
[null,403,"Oldenburg (Oldb), Stadt",{"v":18285,"d":"18 285"},{"v":255,"d":" 255"},{"v":6770,"d":"6 770"},{"v":3295,"d":"3 295"},{"v":5210,"d":"5 210"},{"v":705,"d":" 705"},{"v":4505,"d":"4 505"},{"v":730,"d":" 730"},{"v":270,"d":" 270"},{"v":440,"d":" 440"},{"v":715,"d":" 715"}]
[null,404,"Osnabrück, Stadt",{"v":25290,"d":"25 290"},{"v":495,"d":" 495"},{"v":6570,"d":"6 570"},{"v":5190,"d":"5 190"},{"v":9230,"d":"9 230"},{"v":1570,"d":"1 570"},{"v":7660,"d":"7 660"},{"v":950,"d":" 950"},{"v":555,"d":" 555"},{"v":810,"d":" 810"},{"v":865,"d":" 865"}]
[null,405,"Wilhelmshaven, Stadt",{"v":8785,"d":"8 785"},{"v":105,"d":" 105"},{"v":3475,"d":"3 475"},{"v":1110,"d":"1 110"},{"v":2590,"d":"2 590"},{"v":380,"d":" 380"},{"v":2210,"d":"2 210"},{"v":800,"d":" 800"},{"v":180,"d":" 180"},{"v":150,"d":" 150"},{"v":155,"d":" 155"}]
[null,451,"Ammerland",{"v":8525,"d":"8 525"},{"v":90,"d":" 90"},{"v":2315,"d":"2 315"},{"v":1275,"d":"1 275"},{"v":3640,"d":"3 640"},{"v":340,"d":" 340"},{"v":3300,"d":"3 300"},{"v":160,"d":" 160"},{"v":195,"d":" 195"},{"v":570,"d":" 570"},{"v":120,"d":" 120"}]
[null,452,"Aurich",{"v":11480,"d":"11 480"},{"v":145,"d":" 145"},{"v":2925,"d":"2 925"},{"v":1235,"d":"1 235"},{"v":4850,"d":"4 850"},{"v":260,"d":" 260"},{"v":4590,"d":"4 590"},{"v":910,"d":" 910"},{"v":455,"d":" 455"},{"v":485,"d":" 485"},{"v":335,"d":" 335"}]
[null,453,"Cloppenburg",{"v":18890,"d":"18 890"},{"v":90,"d":" 90"},{"v":3460,"d":"3 460"},{"v":2390,"d":"2 390"},{"v":11385,"d":"11 385"},{"v":565,"d":" 565"},{"v":10820,"d":"10 820"},{"v":300,"d":" 300"},{"v":240,"d":" 240"},{"v":455,"d":" 455"},{"v":370,"d":" 370"}]
[null,454,"Emsland",{"v":40430,"d":"40 430"},{"v":620,"d":" 620"},{"v":6635,"d":"6 635"},{"v":2900,"d":"2 900"},{"v":27015,"d":"27 015"},{"v":1830,"d":"1 830"},{"v":25185,"d":"25 185"},{"v":400,"d":" 400"},{"v":730,"d":" 730"},{"v":885,"d":" 885"},{"v":740,"d":" 740"}]
[null,455,"Friesland",{"v":4840,"d":"4 840"},{"v":200,"d":" 200"},{"v":1525,"d":"1 525"},{"v":655,"d":" 655"},{"v":1420,"d":"1 420"},{"v":320,"d":" 320"},{"v":1100,"d":"1 100"},{"v":205,"d":" 205"},{"v":300,"d":" 300"},{"v":325,"d":" 325"},{"v":155,"d":" 155"}]
[null,456,"Grafschaft Bentheim",{"v":22030,"d":"22 030"},{"v":365,"d":" 365"},{"v":2670,"d":"2 670"},{"v":1930,"d":"1 930"},{"v":15740,"d":"15 740"},{"v":6300,"d":"6 300"},{"v":9440,"d":"9 440"},{"v":125,"d":" 125"},{"v":365,"d":" 365"},{"v":400,"d":" 400"},{"v":285,"d":" 285"}]
[null,457,"Leer",{"v":14855,"d":"14 855"},{"v":225,"d":" 225"},{"v":3225,"d":"3 225"},{"v":1275,"d":"1 275"},{"v":7830,"d":"7 830"},{"v":585,"d":" 585"},{"v":7240,"d":"7 240"},{"v":310,"d":" 310"},{"v":470,"d":" 470"},{"v":800,"d":" 800"},{"v":555,"d":" 555"}]
[null,458,"Oldenburg",{"v":12525,"d":"12 525"},{"v":175,"d":" 175"},{"v":2730,"d":"2 730"},{"v":1375,"d":"1 375"},{"v":7320,"d":"7 320"},{"v":460,"d":" 460"},{"v":6860,"d":"6 860"},{"v":85,"d":" 85"},{"v":160,"d":" 160"},{"v":260,"d":" 260"},{"v":200,"d":" 200"}]
[null,459,"Osnabrück",{"v":33445,"d":"33 445"},{"v":1050,"d":"1 050"},{"v":4495,"d":"4 495"},{"v":5545,"d":"5 545"},{"v":18235,"d":"18 235"},{"v":2120,"d":"2 120"},{"v":16115,"d":"16 115"},{"v":660,"d":" 660"},{"v":675,"d":" 675"},{"v":1215,"d":"1 215"},{"v":1190,"d":"1 190"}]
[null,460,"Vechta",{"v":20715,"d":"20 715"},{"v":240,"d":" 240"},{"v":4825,"d":"4 825"},{"v":3440,"d":"3 440"},{"v":10705,"d":"10 705"},{"v":480,"d":" 480"},{"v":10220,"d":"10 220"},{"v":110,"d":" 110"},{"v":175,"d":" 175"},{"v":300,"d":" 300"},{"v":410,"d":" 410"}]
[null,461,"Wesermarsch",{"v":7780,"d":"7 780"},{"v":275,"d":" 275"},{"v":1275,"d":"1 275"},{"v":1485,"d":"1 485"},{"v":3065,"d":"3 065"},{"v":370,"d":" 370"},{"v":2695,"d":"2 695"},{"v":655,"d":" 655"},{"v":275,"d":" 275"},{"v":345,"d":" 345"},{"v":305,"d":" 305"}]
[null,462,"Wittmund",{"v":2745,"d":"2 745"},{"v":20,"d":" 20"},{"v":720,"d":" 720"},{"v":330,"d":" 330"},{"v":1170,"d":"1 170"},{"v":110,"d":" 110"},{"v":1060,"d":"1 060"},{"v":55,"d":" 55"},{"v":125,"d":" 125"},{"v":205,"d":" 205"},{"v":80,"d":" 80"}]
[null,{"v":4,"d":" 4"},"Stat. Region Weser-Ems",{"v":269505,"d":"269 505"},{"v":4725,"d":"4 725"},{"v":59270,"d":"59 270"},{"v":37010,"d":"37 010"},{"v":136760,"d":"136 760"},{"v":17125,"d":"17 125"},{"v":119635,"d":"119 635"},{"v":6840,"d":"6 840"},{"v":5440,"d":"5 440"},{"v":8055,"d":"8 055"},{"v":6900,"d":"6 900"}]
[null,{"v":0,"d":" 0"},"Niedersachsen",{"v":841165,"d":"841 165"},{"v":19005,"d":"19 005"},{"v":216080,"d":"216 080"},{"v":159825,"d":"159 825"},{"v":332605,"d":"332 605"},{"v":55675,"d":"55 675"},{"v":276930,"d":"276 930"},{"v":25265,"d":"25 265"},{"v":19055,"d":"19 055"},{"v":26695,"d":"26 695"},{"v":25020,"d":"25 020"}]
[]
[null,null,"1) Seit dem 29. Januar 2013 benötigen Bürgerinnen und Bürger der EU keine Freizügigkeitsbescheinigung mehr zur amtlichen Bescheinigung ihres Aufenthaltsrechts in Deutschland. Für den Großteil der Unionsbürgerinnen und Unionsbürger ist daher für 2016 kein Aufenthaltsstatus erfasst. Dieser Personenkreis verfügte dennoch über ein Aufenthaltsrecht in Deutschland."]
[]
[null,null,"Quelle: Ausländerzentralregister"]
[]
[null,null,"Karte A9-2: Anteil der Ausländerinnen und Ausländer mit dem Aufenthaltsstatus Niederlassungserlaubnis oder Aufenthalt nach EU-Recht an allen Ausländerinnen und Ausländern am 31.12.2019 in Prozent"]
{"$rows_empty":40}
[null,null,{"$f":"Def","v":"Die Definition zu dem Indikator sowie methodische Hinweise finden Sie in der Tabelle Aktuelle Ergebnisse"}]
[null,null,"Link zur LSN-Online-Datenbank"]

{"sheet":"A10","index":13,"n_rows":116,"n_cols":10,"rows_kept":116,"merged":[[2,2,2,4],[5,2,5,10],[9,2,10,2],[9,3,10,3],[10,4,10,6],[10,7,10,9],[67,2,67,9],[68,2,68,9],[69,2,70,9],[74,2,74,10],[114,2,114,10]]}
[null,null,{"$f":"Kopf","v":"Migration und Teilhabe in Niedersachsen - Integrationsmonitoring 2020 - Regionalinformationen "}]
[]
[]
[]
[null,null,"Indikator A10: Menschen mit Zuwanderungsgeschichte"]
[null,null,"Tabelle A10-2: Menschen mit und ohne Zuwanderungsgeschichte 2019 nach Kreisen1,3)"]
[]
[]
[]
[null,null,"Kreisfreie Stadt\nLandkreis\n(Großstadt, Umland)\nStatistische Region\nLand","Jahr","Bevölkerung insgesamt","Personen ohne Migrationshintergrund2)","Personen mit Migrationshintergrund2)","Anteil der Personen ohne Migrationshintergrund2)","Anteil der Personen mit Migrationshintergrund2)\nim weiteren Sinne","Anteil der Personen mit Migrationshintergrund2)\nim engeren Sinne"]
[{"$nulls":4},{"v":1000,"d":" 1 000"},null,null,"Prozent"]
[null,"Spalte1","1","2","3","4","5","6","7","8"]
[null,{"v":101,"d":"101.0"},"Braunschweig, Stadt",2018,{"v":243.63571,"d":"  244"},{"v":181.27089,"d":"  181"},{"v":62.36482,"d":"  62"},74.4,25.6,{"v":23.47,"d":"23.5"}]
[null,{"v":102,"d":"102.0"},"Salzgitter, Stadt",2018,{"v":102.74144,"d":"  103"},{"v":66.01907000000001,"d":"  66"},{"v":36.72236,"d":"  37"},{"v":64.26,"d":"64.3"},{"v":35.74,"d":"35.7"},{"v":33.75,"d":"33.8"}]
[null,{"v":103,"d":"103.0"},"Wolfsburg, Stadt",2018,{"v":121.79484,"d":"  122"},{"v":75.22717,"d":"  75"},{"v":46.56768,"d":"  47"},{"v":61.77,"d":"61.8"},{"v":38.23,"d":"38.2"},36.2]
[null,{"v":151,"d":"151.0"},"Gifhorn",2018,{"v":175.28686,"d":"  175"},{"v":128.39846,"d":"  128"},{"v":46.88839,"d":"  47"},{"v":73.25,"d":"73.3"},{"v":26.75,"d":"26.8"},{"v":25.18,"d":"25.2"}]
[null,{"v":153,"d":"153.0"},"Goslar",2018,{"v":133.29014,"d":"  133"},{"v":107.80583,"d":"  108"},{"v":25.484299999999998,"d":"  25"},{"v":80.88,"d":"80.9"},{"v":19.12,"d":"19.1"},{"v":17.66,"d":"17.7"}]
[null,{"v":154,"d":"154.0"},"Helmstedt",2018,{"v":87.32253999999999,"d":"  87"},{"v":73.42208000000001,"d":"  73"},{"v":13.900459999999999,"d":"  14"},{"v":84.08,"d":"84.1"},{"v":15.92,"d":"15.9"},{"v":13.61,"d":"13.6"}]
[null,{"v":155,"d":"155.0"},"Northeim",2018,{"v":129.58364,"d":"  130"},{"v":108.49247,"d":"  108"},{"v":21.091169999999998,"d":"  21"},{"v":83.72,"d":"83.7"},{"v":16.28,"d":"16.3"},{"v":14.64,"d":"14.6"}]
[null,{"v":157,"d":"157.0"},"Peine",2018,{"v":130.24786,"d":"  130"},{"v":103.82208,"d":"  104"},{"v":26.42578,"d":"  26"},{"v":79.71,"d":"79.7"},{"v":20.29,"d":"20.3"},18.8]
[null,{"v":159,"d":"159.0"},"Göttingen",2018,{"v":320.55387,"d":"  321"},{"v":266.11967,"d":"  266"},{"v":54.43419,"d":"  54"},{"v":83.02,"d":"83.0"},{"v":16.98,"d":"17.0"},{"v":15.54,"d":"15.5"}]
[null,{"v":159999,"d":"159999.0"},"Göttingen, Stadt",2018,{"v":202.02335,"d":"  202"},{"v":173.43032,"d":"  173"},{"v":28.59302,"d":"  29"},{"v":85.85,"d":"85.9"},{"v":14.15,"d":"14.2"},{"v":13.26,"d":"13.3"}]
[null,{"v":159016,"d":"159016.0"},"Göttingen Umland",2018,{"v":118.53052000000001,"d":"  119"},{"v":92.68935,"d":"  93"},{"v":25.841169999999998,"d":"  26"},78.2,21.8,{"v":19.41,"d":"19.4"}]
[null,{"v":158,"d":"158.0"},"Wolfenbüttel",2018,{"v":118.0086,"d":"  118"},{"v":99.70084,"d":"  100"},{"v":18.30776,"d":"  18"},{"v":84.49,"d":"  84.5"},{"v":15.51,"d":"15.5"},{"v":14.02,"d":"14.0"}]
[null,{"v":1,"d":"1.0"},"Statistische Region \nBraunschweig",2018,{"v":1563.65424,"d":" 1 564"},{"v":1211.11889,"d":" 1 211"},{"v":352.53535,"d":"  353"},{"v":77.45,"d":"77.5"},{"v":22.55,"d":"22.6"},{"v":20.82,"d":"20.8"}]
[null,{"v":241,"d":"241.0"},"Region Hannover",2018,{"v":1138.66466,"d":" 1 139"},{"v":791.8840600000001,"d":"  792"},{"v":346.7806,"d":"  347"},{"v":69.54,"d":"69.5"},{"v":30.46,"d":"30.5"},28.6]
[null,{"v":241001,"d":"241001.0"},"Hannover, Landeshauptstadt",2018,{"v":528.85624,"d":"  529"},{"v":331.47848999999997,"d":"  331"},{"v":197.37775,"d":"  197"},{"v":62.68,"d":"62.7"},{"v":37.32,"d":"37.3"},{"v":34.91,"d":"34.9"}]
[null,{"v":241999,"d":"241999.0"},"Hannover, Umland",2018,{"v":609.8084200000001,"d":"  610"},{"v":460.40557,"d":"  460"},{"v":149.40285,"d":"  149"},75.5,24.5,{"v":23.12,"d":"23.1"}]
[null,{"v":251,"d":"251.0"},"Diepholz",2018,{"v":213.24074,"d":"  213"},{"v":176.09467999999998,"d":"  176"},{"v":37.14606,"d":"  37"},{"v":82.58,"d":"82.6"},{"v":17.42,"d":"17.4"},{"v":16.62,"d":"16.6"}]
[null,{"v":252,"d":"252.0"},"Hameln-Pyrmont",2018,{"v":146.75383,"d":"  147"},{"v":107.68164,"d":"  108"},{"v":39.07219,"d":"  39"},{"v":73.38,"d":"73.4"},{"v":26.62,"d":"26.6"},{"v":25.93,"d":"25.9"}]
[null,{"v":254,"d":"254.0"},"Hildesheim",2018,{"v":271.30690000000004,"d":"  271"},{"v":209.38745,"d":"  209"},{"v":61.91945,"d":"  62"},{"v":77.18,"d":"77.2"},{"v":22.82,"d":"22.8"},21.1]
[null,{"v":255,"d":"255.0"},"Holzminden",2018,{"v":68.85831,"d":"  69"},{"v":54.939209999999996,"d":"  55"},{"v":13.91911,"d":"  14"},{"v":79.79,"d":"79.8"},{"v":20.21,"d":"20.2"},{"v":19.19,"d":"19.2"}]
[null,{"v":256,"d":"256.0"},"Nienburg (Weser)",2018,{"v":115.54355,"d":"  116"},{"v":85.25175999999999,"d":"  85"},{"v":30.291790000000002,"d":"  30"},{"v":73.78,"d":"73.8"},{"v":26.22,"d":"26.2"},25.4]
[null,{"v":257,"d":"257.0"},"Schaumburg",2018,{"v":153.26935999999998,"d":"  153"},{"v":124.90874000000001,"d":"  125"},{"v":28.360619999999997,"d":"  28"},81.5,18.5,17.5]
[null,{"v":2,"d":"2.0"},"Statistische Region \nHannover",2018,{"v":2107.19606,"d":" 2 107"},{"v":1550.5033999999998,"d":" 1 551"},{"v":556.69266,"d":"  557"},{"v":73.58,"d":"73.6"},{"v":26.42,"d":"26.4"},24.9]
[null,{"v":351,"d":"351.0"},"Celle",2018,{"v":172.94636,"d":"  173"},{"v":139.56713,"d":"  140"},{"v":33.37923,"d":"  33"},80.7,19.3,{"v":17.78,"d":"17.8"}]
[null,{"v":352,"d":"352.0"},"Cuxhaven",2018,{"v":195.10495,"d":"  195"},{"v":164.63307,"d":"  165"},{"v":30.47187,"d":"  30"},{"v":84.38,"d":"84.4"},{"v":15.62,"d":"15.6"},14.7]
[null,{"v":353,"d":"353.0"},"Harburg",2018,{"v":251.36822,"d":"  251"},{"v":198.32566,"d":"  198"},{"v":53.042559999999995,"d":"  53"},78.9,21.1,{"v":19.66,"d":"19.7"}]
[null,"360/ 354","Lüchow-Dannenberg /\nUelzen",2018,{"v":134.97723000000002,"d":"  135"},{"v":113.05122,"d":"  113"},{"v":21.926009999999998,"d":"  22"},{"v":83.76,"d":"83.8"},{"v":16.24,"d":"16.2"},15.4]
[null,{"v":355,"d":"355.0"},"Lüneburg",2018,{"v":178.8614,"d":"  179"},{"v":149.05781,"d":"  149"},{"v":29.80358,"d":"  30"},{"v":83.34,"d":"83.3"},{"v":16.66,"d":"16.7"},15.1]
[null,{"v":356,"d":"356.0"},"Osterholz",2018,{"v":112.43294999999999,"d":"  112"},{"v":96.41460000000001,"d":"  96"},{"v":16.01835,"d":"  16"},{"v":85.75,"d":"85.8"},{"v":14.25,"d":"14.3"},{"v":12.59,"d":"12.6"}]
[null,{"v":357,"d":"357.0"},"Rotenburg (Wümme)",2018,{"v":161.6358,"d":"  162"},{"v":136.77219,"d":"  137"},{"v":24.86361,"d":"  25"},{"v":84.62,"d":"84.6"},{"v":15.38,"d":"15.4"},{"v":14.09,"d":"14.1"}]
[null,{"v":358,"d":"358.0"},"Heidekreis",2018,{"v":134.61828,"d":"  135"},{"v":105.29538000000001,"d":"  105"},{"v":29.3229,"d":"  29"},{"v":78.22,"d":"78.2"},{"v":21.78,"d":"21.8"},{"v":20.78,"d":"20.8"}]
[null,{"v":359,"d":"359.0"},"Stade",2018,{"v":201.51154,"d":"  202"},{"v":165.67978,"d":"  166"},{"v":35.83176,"d":"  36"},{"v":82.22,"d":"82.2"},{"v":17.78,"d":"17.8"},{"v":16.67,"d":"16.7"}]
[null,"360/ 354","Uelzen\nLüchow-Dannenberg",2018,{"v":134.97723000000002,"d":"  135"},{"v":113.05122,"d":"  113"},{"v":21.926009999999998,"d":"  22"},{"v":83.76,"d":"83.8"},{"v":16.24,"d":"16.2"},15.4]
[null,{"v":361,"d":"361.0"},"Verden",2018,{"v":135.29511,"d":"  135"},{"v":108.43221000000001,"d":"  108"},{"v":26.8629,"d":"  27"},{"v":80.14,"d":"80.1"},{"v":19.86,"d":"19.9"},{"v":18.92,"d":"18.9"}]
[null,{"v":3,"d":"3.0"},"Statistische Region \nLüneburg",2018,{"v":1678.52061,"d":" 1 679"},{"v":1376.7728200000001,"d":" 1 377"},{"v":301.74778999999995,"d":"  302"},{"v":82.02,"d":"82.0"},{"v":17.98,"d":"18.0"},{"v":16.74,"d":"16.7"}]
[null,{"v":401,"d":"401.0"},"Delmenhorst, Stadt",2018,{"v":76.72177,"d":"  77"},{"v":50.71994,"d":"  51"},{"v":26.00183,"d":"  26"},{"v":66.11,"d":"66.1"},{"v":33.89,"d":"33.9"},{"v":32.37,"d":"32.4"}]
[null,"402 / 457","Emden, Stadt / Leer",2018,{"v":218.8978,"d":"  219"},{"v":181.48714999999999,"d":"  181"},{"v":37.410650000000004,"d":"  37"},{"v":82.91,"d":"82.9"},{"v":17.09,"d":"17.1"},{"v":16.47,"d":"16.5"}]
[null,{"v":403,"d":"403.0"},"Oldenburg (Oldenburg),\nStadt",2018,{"v":166.34902,"d":"  166"},{"v":137.40318,"d":"  137"},{"v":28.94584,"d":"  29"},82.6,17.4,{"v":15.85,"d":"15.9"}]
[null,{"v":404,"d":"404.0"},"Osnabrück, Stadt",2018,{"v":160.87673,"d":"  161"},{"v":113.57133,"d":"  114"},{"v":47.3054,"d":"  47"},70.6,29.4,{"v":27.81,"d":"27.8"}]
[null,{"v":405,"d":"405.0"},"Wilhelmshaven, Stadt",2018,{"v":73.26126,"d":"  73"},{"v":55.45332,"d":"  55"},{"v":17.80794,"d":"  18"},{"v":75.69,"d":"75.7"},{"v":24.31,"d":"24.3"},{"v":23.69,"d":"23.7"}]
[null,{"v":451,"d":"451.0"},"Ammerland",2018,{"v":123.02145,"d":"  123"},{"v":102.91432,"d":"  103"},{"v":20.10713,"d":"  20"},{"v":83.66,"d":"83.7"},{"v":16.34,"d":"16.3"},{"v":15.64,"d":"15.6"}]
[null,{"v":452,"d":"452.0"},"Aurich",2018,{"v":187.92713,"d":"  188"},{"v":163.44569,"d":"  163"},{"v":24.48144,"d":"  24"},{"v":86.97,"d":"87.0"},{"v":13.03,"d":"13.0"},{"v":12.46,"d":"12.5"}]
[null,{"v":453,"d":"453.0"},"Cloppenburg",2018,{"v":170.11121,"d":"  170"},{"v":119.63444,"d":"  120"},{"v":50.476769999999995,"d":"  50"},{"v":70.33,"d":"70.3"},{"v":29.67,"d":"29.7"},28.8]
[null,{"v":454,"d":"454.0"},"Emsland",2018,{"v":320.35552,"d":"  320"},{"v":247.8098,"d":"  248"},{"v":72.54572,"d":"  73"},{"v":77.35,"d":"77.4"},{"v":22.65,"d":"22.7"},{"v":22.06,"d":"22.1"}]
[null,"455 / 462","Friesland / Wittmund",2018,{"v":153.26273,"d":"  153"},{"v":135.74413,"d":"  136"},{"v":17.5186,"d":"  18"},{"v":88.57,"d":"88.6"},{"v":11.43,"d":"11.4"},{"v":10.82,"d":"10.8"}]
[null,{"v":456,"d":"456.0"},"Grafschaft Bentheim",2018,{"v":133.72686,"d":"  134"},{"v":96.51763000000001,"d":"  97"},{"v":37.209230000000005,"d":"  37"},{"v":72.18,"d":"72.2"},{"v":27.82,"d":"27.8"},{"v":27,"d":"27.0"}]
[null,"402 / 457","Leer / Emden, Stadt",2018,{"v":218.8978,"d":"  219"},{"v":181.48714999999999,"d":"  181"},{"v":37.410650000000004,"d":"  37"},{"v":82.91,"d":"82.9"},{"v":17.09,"d":"17.1"},{"v":16.47,"d":"16.5"}]
[null,{"v":458,"d":"458.0"},"Oldenburg",2018,{"v":130.6855,"d":"  131"},{"v":110.14286,"d":"  110"},{"v":20.542650000000002,"d":"  21"},{"v":84.28,"d":"84.3"},{"v":15.72,"d":"15.7"},{"v":14.48,"d":"14.5"}]
[null,{"v":459,"d":"459.0"},"Osnabrück",2018,{"v":351.57251,"d":"  352"},{"v":269.82844,"d":"  270"},{"v":81.74407000000001,"d":"  82"},{"v":76.75,"d":"76.8"},{"v":23.25,"d":"23.3"},{"v":22.25,"d":"22.3"}]
[null,{"v":460,"d":"460.0"},"Vechta",2018,{"v":140.31824,"d":"  140"},{"v":91.83303,"d":"  92"},{"v":48.48521,"d":"  48"},{"v":65.45,"d":"65.5"},{"v":34.55,"d":"34.6"},{"v":33.75,"d":"33.8"}]
[null,{"v":461,"d":"461.0"},"Wesermarsch",2018,{"v":88.6002,"d":"  89"},{"v":76.97672,"d":"  77"},{"v":11.623479999999999,"d":"  12"},{"v":86.88,"d":"86.9"},{"v":13.12,"d":"13.1"},{"v":11.57,"d":"11.6"}]
[null,"455 / 462","Wittmund / Friesland",2018,{"v":153.26273,"d":"  153"},{"v":135.74413,"d":"  136"},{"v":17.5186,"d":"  18"},{"v":88.57,"d":"88.6"},{"v":11.43,"d":"11.4"},{"v":10.82,"d":"10.8"}]
[null,{"v":4,"d":"4.0"},"Statistische Region \nWeser-Ems",2018,{"v":2495.17229,"d":" 2 495"},{"v":1955.3564099999999,"d":" 1 955"},{"v":539.81588,"d":"  540"},{"v":78.37,"d":"78.4"},{"v":21.63,"d":"21.6"},{"v":20.71,"d":"20.7"}]
[null,{"v":0,"d":"0.0"},"Niedersachsen",2018,{"v":7844.5432,"d":" 7 845"},{"v":6093.75152,"d":" 6 094"},{"v":1750.79168,"d":" 1 751"},{"v":77.68,"d":"77.7"},{"v":22.32,"d":"22.3"},{"v":21.01,"d":"21.0"}]
[]
[null,null,"1) Hochrechnung anhand der Bevölkerungsfortschreibung auf Basis des Zensus 2011. Die Hochrechnung für die Jahre vor 2011 sowie für bislang veröffentlichte Ergebnisse des Mikrozensus 2011-2013 basiert auf den fortgeschriebenen Ergebnissen der Volkszählung 1987. In 2016 erfolgte die Umstellung auf eine neue Mikrozensus-Stichprobe. Ab 2017 wird nur noch die Bevölkerung in Privathaushalten (ohne Gemeinschaftsunterkünfte) ausgewiesen. Dadurch ergibt sich jeweils eine eingeschränkte Vergleichbarkeit mit den Vorjahren. Die im Niedersächsischen Integrationsmonitoring dargestellten dargestellten Ergebnisse des Mikrozensus sind daher nicht direkt mit den Vorjahren vergleichbar. "]
[null,null,"2) Seit dem Jahr 2018 wird im Mikrozensus der Migrationshintergrund im weiteren Sinne jährlich berichtet. Durch eine rückwirkende Revision der Mikrozensusdaten wird auch für das Jahr 2017 der Migrationshintergrund im weiteren Sinne dargestellt. Die in den Tabellen ab dem Jahr 2017 berichteten Daten zum Migrationshintergrund entsprechen dem Migrationshintergrund im weiteren Sinne, bis 2016 wird der Migrationshintergrund im engeren Sinne abgebildet. Die Vergleichbarkeit zwischen den Jahren ist dadurch eingeschränkt."]
[null,null,"3) Kleinere Regionaleinheiten (Emden, Stadt und der Landkreis Leer, die Landkreise Friesland und Wittmund, die Landkreise Uelzen und Lüchow-Dannenberg) werden aus stichprobentheoretischen Gründen zusammengefasst."]
[]
[]
[null,null,"Quelle: Mikrozensus"]
[]
[null,null,"Karte A10-2: Anteil der Personen mit Zuwanderungsgeschichte an der Bevölkerung insgesamt 2019 in Prozent"]
{"$rows_empty":38}
[null,null,{"$f":"Def","v":"Die Definition zu dem Indikator sowie methodische Hinweise finden Sie in der Tabelle Aktuelle Ergebnisse"}]
[null,null,"Link zur LSN-Online-Datenbank"]
[null,null,{"$f":"Link_RegMon","v":"Link zum Regionalmonitoring Niedersachsen"}]

{"sheet":"A15","index":14,"n_rows":113,"n_cols":21,"rows_kept":113,"merged":[[2,2,2,4],[5,2,5,10],[8,1,10,1],[8,2,10,2],[8,3,8,20],[10,3,10,20],[112,2,112,10]]}
[null,null,{"$f":"Kopf","v":"Migration und Teilhabe in Niedersachsen - Integrationsmonitoring 2020 - Regionalinformationen "}]
[]
[]
[]
[null,null,"Indikator A15: Einbürgerungen in Niedersachsen"]
[null,null,"Tabelle A15-2: Einbürgerungen 2005 bis 2019 nach Kreisen"]
[]
[]
[null,"AGS","Kreisfreie Stadt\nLandkreis\n(Großstadt, Umland)\nStatistische Region\nLand","Einbürgerungen"]
[{"$nulls":3},2005,2006,2007,2008,2009,2010,2011,2012,2013,2014,2015,2016,2017,2018,2019,"Veränderung aktuelles Jahr (2019)\nzu 2005","Veränderung aktuelles Jahr (2019)\nzu 2010","Veränderung aktuelles Jahr (2019)\nzu 2018"]
[{"$nulls":3},"Anzahl"]
[null,"AGS","1","2","3","4","5","6","7","8","9","10","11","12","13","14","15","16","17","18","19"]
[null,101,{"$f":"VLOOKUP(B13,AGS_Namen!$C$1:$D$58,2,FALSE)","v":"Braunschweig, Stadt"},{"v":441,"d":" 441"},{"v":440,"d":" 440"},{"v":386,"d":" 386"},{"v":286,"d":" 286"},{"v":294,"d":" 294"},{"v":314,"d":" 314"},{"v":288,"d":" 288"},{"v":408,"d":" 408"},{"v":418,"d":" 418"},{"v":315,"d":" 315"},{"v":379,"d":" 379"},{"v":391,"d":" 391"},{"v":390,"d":" 390"},{"v":249,"d":" 249"},{"v":280,"d":" 280"},{"v":-161,"d":"- 161"},{"v":-34,"d":"- 34"},{"v":31,"d":"+ 31"}]
[null,102,{"$f":"VLOOKUP(B14,AGS_Namen!$C$1:$D$58,2,FALSE)","v":"Salzgitter, Stadt"},{"v":178,"d":" 178"},{"v":201,"d":" 201"},{"v":165,"d":" 165"},{"v":110,"d":" 110"},{"v":136,"d":" 136"},{"v":120,"d":" 120"},{"v":141,"d":" 141"},{"v":159,"d":" 159"},{"v":135,"d":" 135"},{"v":124,"d":" 124"},{"v":123,"d":" 123"},{"v":129,"d":" 129"},{"v":147,"d":" 147"},{"v":162,"d":" 162"},{"v":168,"d":" 168"},{"v":-10,"d":"- 10"},{"v":48,"d":"+ 48"},{"v":6,"d":"+ 6"}]
[null,103,{"$f":"VLOOKUP(B15,AGS_Namen!$C$1:$D$58,2,FALSE)","v":"Wolfsburg, Stadt"},{"v":185,"d":" 185"},{"v":193,"d":" 193"},{"v":216,"d":" 216"},{"v":137,"d":" 137"},{"v":190,"d":" 190"},{"v":194,"d":" 194"},{"v":203,"d":" 203"},{"v":222,"d":" 222"},{"v":252,"d":" 252"},{"v":254,"d":" 254"},{"v":290,"d":" 290"},{"v":317,"d":" 317"},{"v":277,"d":" 277"},{"v":341,"d":" 341"},{"v":325,"d":" 325"},{"v":140,"d":"+ 140"},{"v":131,"d":"+ 131"},{"v":-16,"d":"- 16"}]
[null,151,{"$f":"VLOOKUP(B16,AGS_Namen!$C$1:$D$58,2,FALSE)","v":"Gifhorn"},{"v":177,"d":" 177"},{"v":236,"d":" 236"},{"v":206,"d":" 206"},{"v":137,"d":" 137"},{"v":82,"d":" 82"},{"v":90,"d":" 90"},{"v":88,"d":" 88"},{"v":125,"d":" 125"},{"v":112,"d":" 112"},{"v":114,"d":" 114"},{"v":140,"d":" 140"},{"v":180,"d":" 180"},{"v":143,"d":" 143"},{"v":165,"d":" 165"},{"v":173,"d":" 173"},{"v":-4,"d":"- 4"},{"v":83,"d":"+ 83"},{"v":8,"d":"+ 8"}]
[null,153,{"$f":"VLOOKUP(B17,AGS_Namen!$C$1:$D$58,2,FALSE)","v":"Goslar"},{"v":182,"d":" 182"},{"v":226,"d":" 226"},{"v":166,"d":" 166"},{"v":123,"d":" 123"},{"v":79,"d":" 79"},{"v":135,"d":" 135"},{"v":106,"d":" 106"},{"v":141,"d":" 141"},{"v":116,"d":" 116"},{"v":112,"d":" 112"},{"v":87,"d":" 87"},{"v":128,"d":" 128"},{"v":133,"d":" 133"},{"v":98,"d":" 98"},{"v":102,"d":" 102"},{"v":-80,"d":"- 80"},{"v":-33,"d":"- 33"},{"v":4,"d":"+ 4"}]
[null,154,{"$f":"VLOOKUP(B18,AGS_Namen!$C$1:$D$58,2,FALSE)","v":"Helmstedt"},{"v":40,"d":" 40"},{"v":55,"d":" 55"},{"v":64,"d":" 64"},{"v":45,"d":" 45"},{"v":41,"d":" 41"},{"v":49,"d":" 49"},{"v":55,"d":" 55"},{"v":48,"d":" 48"},{"v":54,"d":" 54"},{"v":28,"d":" 28"},{"v":42,"d":" 42"},{"v":38,"d":" 38"},{"v":64,"d":" 64"},{"v":59,"d":" 59"},{"v":96,"d":" 96"},{"v":56,"d":"+ 56"},{"v":47,"d":"+ 47"},{"v":37,"d":"+ 37"}]
[null,155,{"$f":"VLOOKUP(B19,AGS_Namen!$C$1:$D$58,2,FALSE)","v":"Northeim"},{"v":113,"d":" 113"},{"v":169,"d":" 169"},{"v":132,"d":" 132"},{"v":66,"d":" 66"},{"v":42,"d":" 42"},{"v":70,"d":" 70"},{"v":84,"d":" 84"},{"v":102,"d":" 102"},{"v":101,"d":" 101"},{"v":74,"d":" 74"},{"v":62,"d":" 62"},{"v":100,"d":" 100"},{"v":84,"d":" 84"},{"v":106,"d":" 106"},{"v":129,"d":" 129"},{"v":16,"d":"+ 16"},{"v":59,"d":"+ 59"},{"v":23,"d":"+ 23"}]
[null,157,{"$f":"VLOOKUP(B20,AGS_Namen!$C$1:$D$58,2,FALSE)","v":"Peine"},{"v":216,"d":" 216"},{"v":198,"d":" 198"},{"v":167,"d":" 167"},{"v":140,"d":" 140"},{"v":84,"d":" 84"},{"v":119,"d":" 119"},{"v":124,"d":" 124"},{"v":138,"d":" 138"},{"v":119,"d":" 119"},{"v":105,"d":" 105"},{"v":136,"d":" 136"},{"v":115,"d":" 115"},{"v":154,"d":" 154"},{"v":129,"d":" 129"},{"v":192,"d":" 192"},{"v":-24,"d":"- 24"},{"v":73,"d":"+ 73"},{"v":63,"d":"+ 63"}]
[null,158,{"$f":"VLOOKUP(B21,AGS_Namen!$C$1:$D$58,2,FALSE)","v":"Wolfenbüttel"},{"v":145,"d":" 145"},{"v":187,"d":" 187"},{"v":112,"d":" 112"},{"v":106,"d":" 106"},{"v":71,"d":" 71"},{"v":77,"d":" 77"},{"v":100,"d":" 100"},{"v":97,"d":" 97"},{"v":113,"d":" 113"},{"v":104,"d":" 104"},{"v":116,"d":" 116"},{"v":124,"d":" 124"},{"v":109,"d":" 109"},{"v":118,"d":" 118"},{"v":134,"d":" 134"},{"v":-11,"d":"- 11"},{"v":57,"d":"+ 57"},{"v":16,"d":"+ 16"}]
[null,159,{"$f":"VLOOKUP(B22,AGS_Namen!$C$1:$D$58,2,FALSE)","v":"Göttingen"},{"v":424,"d":" 424"},{"v":499,"d":" 499"},{"v":383,"d":" 383"},{"v":274,"d":" 274"},{"v":222,"d":" 222"},{"v":183,"d":" 183"},{"v":312,"d":" 312"},{"v":348,"d":" 348"},{"v":299,"d":" 299"},{"v":290,"d":" 290"},{"v":320,"d":" 320"},{"v":345,"d":" 345"},{"v":340,"d":" 340"},{"v":354,"d":" 354"},{"v":378,"d":" 378"},{"v":-46,"d":"- 46"},{"v":195,"d":"+ 195"},{"v":24,"d":"+ 24"}]
[null,1,{"$f":"VLOOKUP(B23,AGS_Namen!$C$1:$D$58,2,FALSE)","v":"Stat. Region Braunschweig"},{"v":2101,"d":"2 101"},{"v":2404,"d":"2 404"},{"v":1997,"d":"1 997"},{"v":1424,"d":"1 424"},{"v":1241,"d":"1 241"},{"v":1351,"d":"1 351"},{"v":1501,"d":"1 501"},{"v":1788,"d":"1 788"},{"v":1719,"d":"1 719"},{"v":1520,"d":"1 520"},{"v":1695,"d":"1 695"},{"v":1867,"d":"1 867"},{"v":1841,"d":"1 841"},{"v":1781,"d":"1 781"},{"v":1977,"d":"1 977"},{"v":-124,"d":"- 124"},{"v":626,"d":"+ 626"},{"v":196,"d":"+ 196"}]
[null,241,{"$f":"VLOOKUP(B24,AGS_Namen!$C$1:$D$58,2,FALSE)","v":"Hannover, Region"},{"v":2810,"d":"2 810"},{"v":2779,"d":"2 779"},{"v":2364,"d":"2 364"},{"v":2144,"d":"2 144"},{"v":2002,"d":"2 002"},{"v":1866,"d":"1 866"},{"v":2166,"d":"2 166"},{"v":2363,"d":"2 363"},{"v":2061,"d":"2 061"},{"v":2057,"d":"2 057"},{"v":1932,"d":"1 932"},{"v":2128,"d":"2 128"},{"v":2234,"d":"2 234"},{"v":1973,"d":"1 973"},{"v":2465,"d":"2 465"},{"v":-345,"d":"- 345"},{"v":599,"d":"+ 599"},{"v":492,"d":"+ 492"}]
[null,241001,{"$f":"VLOOKUP(B25,AGS_Namen!$C$1:$D$58,2,FALSE)","v":"   dav. Hannover, Lhst."},{"v":1605,"d":"1 605"},{"v":1748,"d":"1 748"},{"v":1671,"d":"1 671"},{"v":1431,"d":"1 431"},{"v":1329,"d":"1 329"},{"v":1276,"d":"1 276"},{"v":1449,"d":"1 449"},{"v":1509,"d":"1 509"},{"v":1337,"d":"1 337"},{"v":1375,"d":"1 375"},{"v":1202,"d":"1 202"},{"v":1300,"d":"1 300"},{"v":1321,"d":"1 321"},{"v":1131,"d":"1 131"},{"v":1404,"d":"1 404"},{"v":-201,"d":"- 201"},{"v":128,"d":"+ 128"},{"v":273,"d":"+ 273"}]
[null,241999,{"$f":"VLOOKUP(B26,AGS_Namen!$C$1:$D$58,2,FALSE)","v":"   dav. Hannover, Umland"},{"v":1205,"d":"1 205"},{"v":1031,"d":"1 031"},{"v":693,"d":" 693"},{"v":713,"d":" 713"},{"v":673,"d":" 673"},{"v":590,"d":" 590"},{"v":717,"d":" 717"},{"v":854,"d":" 854"},{"v":724,"d":" 724"},{"v":682,"d":" 682"},{"v":730,"d":" 730"},{"v":828,"d":" 828"},{"v":913,"d":" 913"},{"v":842,"d":" 842"},{"v":1061,"d":"1 061"},{"v":-144,"d":"- 144"},{"v":471,"d":"+ 471"},{"v":219,"d":"+ 219"}]
[null,251,{"$f":"VLOOKUP(B27,AGS_Namen!$C$1:$D$58,2,FALSE)","v":"Diepholz"},{"v":261,"d":" 261"},{"v":251,"d":" 251"},{"v":241,"d":" 241"},{"v":182,"d":" 182"},{"v":137,"d":" 137"},{"v":143,"d":" 143"},{"v":135,"d":" 135"},{"v":146,"d":" 146"},{"v":157,"d":" 157"},{"v":145,"d":" 145"},{"v":121,"d":" 121"},{"v":180,"d":" 180"},{"v":196,"d":" 196"},{"v":235,"d":" 235"},{"v":308,"d":" 308"},{"v":47,"d":"+ 47"},{"v":165,"d":"+ 165"},{"v":73,"d":"+ 73"}]
[null,252,{"$f":"VLOOKUP(B28,AGS_Namen!$C$1:$D$58,2,FALSE)","v":"Hameln-Pyrmont"},{"v":308,"d":" 308"},{"v":258,"d":" 258"},{"v":202,"d":" 202"},{"v":181,"d":" 181"},{"v":131,"d":" 131"},{"v":93,"d":" 93"},{"v":138,"d":" 138"},{"v":155,"d":" 155"},{"v":180,"d":" 180"},{"v":90,"d":" 90"},{"v":186,"d":" 186"},{"v":159,"d":" 159"},{"v":164,"d":" 164"},{"v":193,"d":" 193"},{"v":278,"d":" 278"},{"v":-30,"d":"- 30"},{"v":185,"d":"+ 185"},{"v":85,"d":"+ 85"}]
[null,254,{"$f":"VLOOKUP(B29,AGS_Namen!$C$1:$D$58,2,FALSE)","v":"Hildesheim"},{"v":559,"d":" 559"},{"v":602,"d":" 602"},{"v":383,"d":" 383"},{"v":334,"d":" 334"},{"v":244,"d":" 244"},{"v":245,"d":" 245"},{"v":260,"d":" 260"},{"v":268,"d":" 268"},{"v":259,"d":" 259"},{"v":283,"d":" 283"},{"v":234,"d":" 234"},{"v":251,"d":" 251"},{"v":239,"d":" 239"},{"v":303,"d":" 303"},{"v":355,"d":" 355"},{"v":-204,"d":"- 204"},{"v":110,"d":"+ 110"},{"v":52,"d":"+ 52"}]
[null,255,{"$f":"VLOOKUP(B30,AGS_Namen!$C$1:$D$58,2,FALSE)","v":"Holzminden"},{"v":58,"d":" 58"},{"v":56,"d":" 56"},{"v":26,"d":" 26"},{"v":47,"d":" 47"},{"v":47,"d":" 47"},{"v":36,"d":" 36"},{"v":52,"d":" 52"},{"v":62,"d":" 62"},{"v":33,"d":" 33"},{"v":44,"d":" 44"},{"v":55,"d":" 55"},{"v":26,"d":" 26"},{"v":58,"d":" 58"},{"v":50,"d":" 50"},{"v":59,"d":" 59"},{"v":1,"d":"+ 1"},{"v":23,"d":"+ 23"},{"v":9,"d":"+ 9"}]
[null,256,{"$f":"VLOOKUP(B31,AGS_Namen!$C$1:$D$58,2,FALSE)","v":"Nienburg (Weser)"},{"v":194,"d":" 194"},{"v":167,"d":" 167"},{"v":113,"d":" 113"},{"v":73,"d":" 73"},{"v":106,"d":" 106"},{"v":132,"d":" 132"},{"v":121,"d":" 121"},{"v":110,"d":" 110"},{"v":107,"d":" 107"},{"v":102,"d":" 102"},{"v":124,"d":" 124"},{"v":115,"d":" 115"},{"v":83,"d":" 83"},{"v":102,"d":" 102"},{"v":170,"d":" 170"},{"v":-24,"d":"- 24"},{"v":38,"d":"+ 38"},{"v":68,"d":"+ 68"}]
[null,257,{"$f":"VLOOKUP(B32,AGS_Namen!$C$1:$D$58,2,FALSE)","v":"Schaumburg"},{"v":231,"d":" 231"},{"v":297,"d":" 297"},{"v":184,"d":" 184"},{"v":116,"d":" 116"},{"v":127,"d":" 127"},{"v":124,"d":" 124"},{"v":130,"d":" 130"},{"v":161,"d":" 161"},{"v":146,"d":" 146"},{"v":111,"d":" 111"},{"v":173,"d":" 173"},{"v":146,"d":" 146"},{"v":172,"d":" 172"},{"v":134,"d":" 134"},{"v":234,"d":" 234"},{"v":3,"d":"+ 3"},{"v":110,"d":"+ 110"},{"v":100,"d":"+ 100"}]
[null,2,{"$f":"VLOOKUP(B33,AGS_Namen!$C$1:$D$58,2,FALSE)","v":"Stat. Region Hannover"},{"v":4421,"d":"4 421"},{"v":4410,"d":"4 410"},{"v":3513,"d":"3 513"},{"v":3077,"d":"3 077"},{"v":2794,"d":"2 794"},{"v":2639,"d":"2 639"},{"v":3002,"d":"3 002"},{"v":3265,"d":"3 265"},{"v":2943,"d":"2 943"},{"v":2832,"d":"2 832"},{"v":2825,"d":"2 825"},{"v":3005,"d":"3 005"},{"v":3146,"d":"3 146"},{"v":2990,"d":"2 990"},{"v":3869,"d":"3 869"},{"v":-552,"d":"- 552"},{"v":1230,"d":"+1 230"},{"v":879,"d":"+ 879"}]
[null,351,{"$f":"VLOOKUP(B34,AGS_Namen!$C$1:$D$58,2,FALSE)","v":"Celle"},{"v":214,"d":" 214"},{"v":263,"d":" 263"},{"v":163,"d":" 163"},{"v":120,"d":" 120"},{"v":137,"d":" 137"},{"v":136,"d":" 136"},{"v":160,"d":" 160"},{"v":120,"d":" 120"},{"v":148,"d":" 148"},{"v":149,"d":" 149"},{"v":197,"d":" 197"},{"v":124,"d":" 124"},{"v":191,"d":" 191"},{"v":170,"d":" 170"},{"v":338,"d":" 338"},{"v":124,"d":"+ 124"},{"v":202,"d":"+ 202"},{"v":168,"d":"+ 168"}]
[null,352,{"$f":"VLOOKUP(B35,AGS_Namen!$C$1:$D$58,2,FALSE)","v":"Cuxhaven"},{"v":184,"d":" 184"},{"v":147,"d":" 147"},{"v":130,"d":" 130"},{"v":130,"d":" 130"},{"v":123,"d":" 123"},{"v":114,"d":" 114"},{"v":116,"d":" 116"},{"v":141,"d":" 141"},{"v":125,"d":" 125"},{"v":114,"d":" 114"},{"v":127,"d":" 127"},{"v":133,"d":" 133"},{"v":166,"d":" 166"},{"v":114,"d":" 114"},{"v":149,"d":" 149"},{"v":-35,"d":"- 35"},{"v":35,"d":"+ 35"},{"v":35,"d":"+ 35"}]
[null,353,{"$f":"VLOOKUP(B36,AGS_Namen!$C$1:$D$58,2,FALSE)","v":"Harburg"},{"v":301,"d":" 301"},{"v":257,"d":" 257"},{"v":177,"d":" 177"},{"v":169,"d":" 169"},{"v":204,"d":" 204"},{"v":207,"d":" 207"},{"v":225,"d":" 225"},{"v":153,"d":" 153"},{"v":194,"d":" 194"},{"v":236,"d":" 236"},{"v":203,"d":" 203"},{"v":298,"d":" 298"},{"v":345,"d":" 345"},{"v":282,"d":" 282"},{"v":279,"d":" 279"},{"v":-22,"d":"- 22"},{"v":72,"d":"+ 72"},{"v":-3,"d":"- 3"}]
[null,354,{"$f":"VLOOKUP(B37,AGS_Namen!$C$1:$D$58,2,FALSE)","v":"Lüchow-Dannenberg"},{"v":5,"d":" 5"},{"v":10,"d":" 10"},{"v":17,"d":" 17"},{"v":13,"d":" 13"},{"v":8,"d":" 8"},{"v":6,"d":" 6"},{"v":5,"d":" 5"},{"v":13,"d":" 13"},{"v":12,"d":" 12"},{"v":7,"d":" 7"},{"v":10,"d":" 10"},{"v":17,"d":" 17"},{"v":20,"d":" 20"},{"v":19,"d":" 19"},{"v":26,"d":" 26"},{"v":21,"d":"+ 21"},{"v":20,"d":"+ 20"},{"v":7,"d":"+ 7"}]
[null,355,{"$f":"VLOOKUP(B38,AGS_Namen!$C$1:$D$58,2,FALSE)","v":"Lüneburg"},{"v":197,"d":" 197"},{"v":186,"d":" 186"},{"v":157,"d":" 157"},{"v":209,"d":" 209"},{"v":167,"d":" 167"},{"v":172,"d":" 172"},{"v":152,"d":" 152"},{"v":199,"d":" 199"},{"v":185,"d":" 185"},{"v":199,"d":" 199"},{"v":158,"d":" 158"},{"v":158,"d":" 158"},{"v":168,"d":" 168"},{"v":148,"d":" 148"},{"v":253,"d":" 253"},{"v":56,"d":"+ 56"},{"v":81,"d":"+ 81"},{"v":105,"d":"+ 105"}]
[null,356,{"$f":"VLOOKUP(B39,AGS_Namen!$C$1:$D$58,2,FALSE)","v":"Osterholz"},{"v":59,"d":" 59"},{"v":60,"d":" 60"},{"v":53,"d":" 53"},{"v":53,"d":" 53"},{"v":66,"d":" 66"},{"v":67,"d":" 67"},{"v":47,"d":" 47"},{"v":75,"d":" 75"},{"v":57,"d":" 57"},{"v":65,"d":" 65"},{"v":84,"d":" 84"},{"v":70,"d":" 70"},{"v":54,"d":" 54"},{"v":72,"d":" 72"},{"v":114,"d":" 114"},{"v":55,"d":"+ 55"},{"v":47,"d":"+ 47"},{"v":42,"d":"+ 42"}]
[null,357,{"$f":"VLOOKUP(B40,AGS_Namen!$C$1:$D$58,2,FALSE)","v":"Rotenburg (Wümme)"},{"v":86,"d":" 86"},{"v":84,"d":" 84"},{"v":103,"d":" 103"},{"v":83,"d":" 83"},{"v":109,"d":" 109"},{"v":103,"d":" 103"},{"v":123,"d":" 123"},{"v":106,"d":" 106"},{"v":118,"d":" 118"},{"v":105,"d":" 105"},{"v":93,"d":" 93"},{"v":88,"d":" 88"},{"v":87,"d":" 87"},{"v":107,"d":" 107"},{"v":126,"d":" 126"},{"v":40,"d":"+ 40"},{"v":23,"d":"+ 23"},{"v":19,"d":"+ 19"}]
[null,358,{"$f":"VLOOKUP(B41,AGS_Namen!$C$1:$D$58,2,FALSE)","v":"Heidekreis"},{"v":146,"d":" 146"},{"v":135,"d":" 135"},{"v":128,"d":" 128"},{"v":122,"d":" 122"},{"v":93,"d":" 93"},{"v":80,"d":" 80"},{"v":114,"d":" 114"},{"v":114,"d":" 114"},{"v":108,"d":" 108"},{"v":99,"d":" 99"},{"v":101,"d":" 101"},{"v":123,"d":" 123"},{"v":130,"d":" 130"},{"v":146,"d":" 146"},{"v":192,"d":" 192"},{"v":46,"d":"+ 46"},{"v":112,"d":"+ 112"},{"v":46,"d":"+ 46"}]
[null,359,{"$f":"VLOOKUP(B42,AGS_Namen!$C$1:$D$58,2,FALSE)","v":"Stade"},{"v":298,"d":" 298"},{"v":288,"d":" 288"},{"v":189,"d":" 189"},{"v":127,"d":" 127"},{"v":134,"d":" 134"},{"v":152,"d":" 152"},{"v":122,"d":" 122"},{"v":166,"d":" 166"},{"v":172,"d":" 172"},{"v":144,"d":" 144"},{"v":147,"d":" 147"},{"v":160,"d":" 160"},{"v":114,"d":" 114"},{"v":180,"d":" 180"},{"v":279,"d":" 279"},{"v":-19,"d":"- 19"},{"v":127,"d":"+ 127"},{"v":99,"d":"+ 99"}]
[null,360,{"$f":"VLOOKUP(B43,AGS_Namen!$C$1:$D$58,2,FALSE)","v":"Uelzen"},{"v":53,"d":" 53"},{"v":57,"d":" 57"},{"v":43,"d":" 43"},{"v":74,"d":" 74"},{"v":51,"d":" 51"},{"v":44,"d":" 44"},{"v":57,"d":" 57"},{"v":47,"d":" 47"},{"v":34,"d":" 34"},{"v":17,"d":" 17"},{"v":40,"d":" 40"},{"v":39,"d":" 39"},{"v":19,"d":" 19"},{"v":46,"d":" 46"},{"v":74,"d":" 74"},{"v":21,"d":"+ 21"},{"v":30,"d":"+ 30"},{"v":28,"d":"+ 28"}]
[null,361,{"$f":"VLOOKUP(B44,AGS_Namen!$C$1:$D$58,2,FALSE)","v":"Verden"},{"v":177,"d":" 177"},{"v":148,"d":" 148"},{"v":128,"d":" 128"},{"v":91,"d":" 91"},{"v":124,"d":" 124"},{"v":117,"d":" 117"},{"v":144,"d":" 144"},{"v":132,"d":" 132"},{"v":122,"d":" 122"},{"v":134,"d":" 134"},{"v":143,"d":" 143"},{"v":121,"d":" 121"},{"v":115,"d":" 115"},{"v":105,"d":" 105"},{"v":177,"d":" 177"},{"v":0,"d":" 0"},{"v":60,"d":"+ 60"},{"v":72,"d":"+ 72"}]
[null,3,{"$f":"VLOOKUP(B45,AGS_Namen!$C$1:$D$58,2,FALSE)","v":"Stat. Region Lüneburg"},{"v":1720,"d":"1 720"},{"v":1635,"d":"1 635"},{"v":1288,"d":"1 288"},{"v":1191,"d":"1 191"},{"v":1216,"d":"1 216"},{"v":1198,"d":"1 198"},{"v":1265,"d":"1 265"},{"v":1266,"d":"1 266"},{"v":1275,"d":"1 275"},{"v":1269,"d":"1 269"},{"v":1303,"d":"1 303"},{"v":1331,"d":"1 331"},{"v":1409,"d":"1 409"},{"v":1389,"d":"1 389"},{"v":2007,"d":"2 007"},{"v":287,"d":"+ 287"},{"v":809,"d":"+ 809"},{"v":618,"d":"+ 618"}]
[null,401,{"$f":"VLOOKUP(B46,AGS_Namen!$C$1:$D$58,2,FALSE)","v":"Delmenhorst, Stadt"},{"v":198,"d":" 198"},{"v":269,"d":" 269"},{"v":267,"d":" 267"},{"v":192,"d":" 192"},{"v":204,"d":" 204"},{"v":214,"d":" 214"},{"v":202,"d":" 202"},{"v":180,"d":" 180"},{"v":152,"d":" 152"},{"v":139,"d":" 139"},{"v":121,"d":" 121"},{"v":122,"d":" 122"},{"v":87,"d":" 87"},{"v":123,"d":" 123"},{"v":155,"d":" 155"},{"v":-43,"d":"- 43"},{"v":-59,"d":"- 59"},{"v":32,"d":"+ 32"}]
[null,402,{"$f":"VLOOKUP(B47,AGS_Namen!$C$1:$D$58,2,FALSE)","v":"Emden, Stadt"},{"v":47,"d":" 47"},{"v":82,"d":" 82"},{"v":75,"d":" 75"},{"v":31,"d":" 31"},{"v":37,"d":" 37"},{"v":36,"d":" 36"},{"v":46,"d":" 46"},{"v":25,"d":" 25"},{"v":72,"d":" 72"},{"v":75,"d":" 75"},{"v":66,"d":" 66"},{"v":47,"d":" 47"},{"v":42,"d":" 42"},{"v":40,"d":" 40"},{"v":34,"d":" 34"},{"v":-13,"d":"- 13"},{"v":-2,"d":"- 2"},{"v":-6,"d":"- 6"}]
[null,403,{"$f":"VLOOKUP(B48,AGS_Namen!$C$1:$D$58,2,FALSE)","v":"Oldenburg (Oldb), Stadt"},{"v":245,"d":" 245"},{"v":264,"d":" 264"},{"v":253,"d":" 253"},{"v":278,"d":" 278"},{"v":215,"d":" 215"},{"v":234,"d":" 234"},{"v":222,"d":" 222"},{"v":210,"d":" 210"},{"v":245,"d":" 245"},{"v":214,"d":" 214"},{"v":252,"d":" 252"},{"v":320,"d":" 320"},{"v":287,"d":" 287"},{"v":310,"d":" 310"},{"v":303,"d":" 303"},{"v":58,"d":"+ 58"},{"v":69,"d":"+ 69"},{"v":-7,"d":"- 7"}]
[null,404,{"$f":"VLOOKUP(B49,AGS_Namen!$C$1:$D$58,2,FALSE)","v":"Osnabrück, Stadt"},{"v":460,"d":" 460"},{"v":534,"d":" 534"},{"v":366,"d":" 366"},{"v":255,"d":" 255"},{"v":222,"d":" 222"},{"v":233,"d":" 233"},{"v":260,"d":" 260"},{"v":258,"d":" 258"},{"v":265,"d":" 265"},{"v":240,"d":" 240"},{"v":273,"d":" 273"},{"v":279,"d":" 279"},{"v":291,"d":" 291"},{"v":309,"d":" 309"},{"v":407,"d":" 407"},{"v":-53,"d":"- 53"},{"v":174,"d":"+ 174"},{"v":98,"d":"+ 98"}]
[null,405,{"$f":"VLOOKUP(B50,AGS_Namen!$C$1:$D$58,2,FALSE)","v":"Wilhelmshaven, Stadt"},{"v":183,"d":" 183"},{"v":146,"d":" 146"},{"v":129,"d":" 129"},{"v":88,"d":" 88"},{"v":110,"d":" 110"},{"v":107,"d":" 107"},{"v":83,"d":" 83"},{"v":83,"d":" 83"},{"v":109,"d":" 109"},{"v":91,"d":" 91"},{"v":100,"d":" 100"},{"v":116,"d":" 116"},{"v":115,"d":" 115"},{"v":109,"d":" 109"},{"v":125,"d":" 125"},{"v":-58,"d":"- 58"},{"v":18,"d":"+ 18"},{"v":16,"d":"+ 16"}]
[null,451,{"$f":"VLOOKUP(B51,AGS_Namen!$C$1:$D$58,2,FALSE)","v":"Ammerland"},{"v":91,"d":" 91"},{"v":101,"d":" 101"},{"v":68,"d":" 68"},{"v":71,"d":" 71"},{"v":44,"d":" 44"},{"v":63,"d":" 63"},{"v":76,"d":" 76"},{"v":87,"d":" 87"},{"v":74,"d":" 74"},{"v":100,"d":" 100"},{"v":153,"d":" 153"},{"v":177,"d":" 177"},{"v":132,"d":" 132"},{"v":57,"d":" 57"},{"v":111,"d":" 111"},{"v":20,"d":"+ 20"},{"v":48,"d":"+ 48"},{"v":54,"d":"+ 54"}]
[null,452,{"$f":"VLOOKUP(B52,AGS_Namen!$C$1:$D$58,2,FALSE)","v":"Aurich"},{"v":201,"d":" 201"},{"v":166,"d":" 166"},{"v":158,"d":" 158"},{"v":97,"d":" 97"},{"v":106,"d":" 106"},{"v":138,"d":" 138"},{"v":148,"d":" 148"},{"v":116,"d":" 116"},{"v":122,"d":" 122"},{"v":112,"d":" 112"},{"v":108,"d":" 108"},{"v":145,"d":" 145"},{"v":155,"d":" 155"},{"v":144,"d":" 144"},{"v":142,"d":" 142"},{"v":-59,"d":"- 59"},{"v":4,"d":"+ 4"},{"v":-2,"d":"- 2"}]
[null,453,{"$f":"VLOOKUP(B53,AGS_Namen!$C$1:$D$58,2,FALSE)","v":"Cloppenburg"},{"v":83,"d":" 83"},{"v":123,"d":" 123"},{"v":117,"d":" 117"},{"v":68,"d":" 68"},{"v":101,"d":" 101"},{"v":89,"d":" 89"},{"v":109,"d":" 109"},{"v":124,"d":" 124"},{"v":103,"d":" 103"},{"v":108,"d":" 108"},{"v":101,"d":" 101"},{"v":74,"d":" 74"},{"v":117,"d":" 117"},{"v":122,"d":" 122"},{"v":149,"d":" 149"},{"v":66,"d":"+ 66"},{"v":60,"d":"+ 60"},{"v":27,"d":"+ 27"}]
[null,454,{"$f":"VLOOKUP(B54,AGS_Namen!$C$1:$D$58,2,FALSE)","v":"Emsland"},{"v":165,"d":" 165"},{"v":183,"d":" 183"},{"v":130,"d":" 130"},{"v":118,"d":" 118"},{"v":109,"d":" 109"},{"v":152,"d":" 152"},{"v":171,"d":" 171"},{"v":157,"d":" 157"},{"v":146,"d":" 146"},{"v":163,"d":" 163"},{"v":116,"d":" 116"},{"v":184,"d":" 184"},{"v":156,"d":" 156"},{"v":127,"d":" 127"},{"v":237,"d":" 237"},{"v":72,"d":"+ 72"},{"v":85,"d":"+ 85"},{"v":110,"d":"+ 110"}]
[null,455,{"$f":"VLOOKUP(B55,AGS_Namen!$C$1:$D$58,2,FALSE)","v":"Friesland"},{"v":71,"d":" 71"},{"v":43,"d":" 43"},{"v":48,"d":" 48"},{"v":64,"d":" 64"},{"v":39,"d":" 39"},{"v":81,"d":" 81"},{"v":66,"d":" 66"},{"v":47,"d":" 47"},{"v":80,"d":" 80"},{"v":70,"d":" 70"},{"v":54,"d":" 54"},{"v":33,"d":" 33"},{"v":25,"d":" 25"},{"v":31,"d":" 31"},{"v":81,"d":" 81"},{"v":10,"d":"+ 10"},{"v":0,"d":" 0"},{"v":50,"d":"+ 50"}]
[null,456,{"$f":"VLOOKUP(B56,AGS_Namen!$C$1:$D$58,2,FALSE)","v":"Grafschaft Bentheim"},{"v":114,"d":" 114"},{"v":115,"d":" 115"},{"v":124,"d":" 124"},{"v":116,"d":" 116"},{"v":109,"d":" 109"},{"v":132,"d":" 132"},{"v":133,"d":" 133"},{"v":131,"d":" 131"},{"v":136,"d":" 136"},{"v":138,"d":" 138"},{"v":172,"d":" 172"},{"v":112,"d":" 112"},{"v":124,"d":" 124"},{"v":173,"d":" 173"},{"v":207,"d":" 207"},{"v":93,"d":"+ 93"},{"v":75,"d":"+ 75"},{"v":34,"d":"+ 34"}]
[null,457,{"$f":"VLOOKUP(B57,AGS_Namen!$C$1:$D$58,2,FALSE)","v":"Leer"},{"v":124,"d":" 124"},{"v":173,"d":" 173"},{"v":124,"d":" 124"},{"v":110,"d":" 110"},{"v":129,"d":" 129"},{"v":121,"d":" 121"},{"v":86,"d":" 86"},{"v":94,"d":" 94"},{"v":92,"d":" 92"},{"v":81,"d":" 81"},{"v":98,"d":" 98"},{"v":93,"d":" 93"},{"v":97,"d":" 97"},{"v":94,"d":" 94"},{"v":143,"d":" 143"},{"v":19,"d":"+ 19"},{"v":22,"d":"+ 22"},{"v":49,"d":"+ 49"}]
[null,458,{"$f":"VLOOKUP(B58,AGS_Namen!$C$1:$D$58,2,FALSE)","v":"Oldenburg"},{"v":91,"d":" 91"},{"v":99,"d":" 99"},{"v":81,"d":" 81"},{"v":61,"d":" 61"},{"v":81,"d":" 81"},{"v":95,"d":" 95"},{"v":144,"d":" 144"},{"v":129,"d":" 129"},{"v":131,"d":" 131"},{"v":103,"d":" 103"},{"v":99,"d":" 99"},{"v":118,"d":" 118"},{"v":126,"d":" 126"},{"v":104,"d":" 104"},{"v":170,"d":" 170"},{"v":79,"d":"+ 79"},{"v":75,"d":"+ 75"},{"v":66,"d":"+ 66"}]
[null,459,{"$f":"VLOOKUP(B59,AGS_Namen!$C$1:$D$58,2,FALSE)","v":"Osnabrück"},{"v":166,"d":" 166"},{"v":338,"d":" 338"},{"v":183,"d":" 183"},{"v":219,"d":" 219"},{"v":189,"d":" 189"},{"v":211,"d":" 211"},{"v":194,"d":" 194"},{"v":228,"d":" 228"},{"v":231,"d":" 231"},{"v":207,"d":" 207"},{"v":183,"d":" 183"},{"v":222,"d":" 222"},{"v":287,"d":" 287"},{"v":298,"d":" 298"},{"v":428,"d":" 428"},{"v":262,"d":"+ 262"},{"v":217,"d":"+ 217"},{"v":130,"d":"+ 130"}]
[null,460,{"$f":"VLOOKUP(B60,AGS_Namen!$C$1:$D$58,2,FALSE)","v":"Vechta"},{"v":287,"d":" 287"},{"v":236,"d":" 236"},{"v":213,"d":" 213"},{"v":150,"d":" 150"},{"v":179,"d":" 179"},{"v":164,"d":" 164"},{"v":215,"d":" 215"},{"v":205,"d":" 205"},{"v":207,"d":" 207"},{"v":176,"d":" 176"},{"v":165,"d":" 165"},{"v":169,"d":" 169"},{"v":228,"d":" 228"},{"v":171,"d":" 171"},{"v":231,"d":" 231"},{"v":-56,"d":"- 56"},{"v":67,"d":"+ 67"},{"v":60,"d":"+ 60"}]
[null,461,{"$f":"VLOOKUP(B61,AGS_Namen!$C$1:$D$58,2,FALSE)","v":"Wesermarsch"},{"v":91,"d":" 91"},{"v":93,"d":" 93"},{"v":96,"d":" 96"},{"v":83,"d":" 83"},{"v":86,"d":" 86"},{"v":75,"d":" 75"},{"v":60,"d":" 60"},{"v":95,"d":" 95"},{"v":85,"d":" 85"},{"v":69,"d":" 69"},{"v":79,"d":" 79"},{"v":87,"d":" 87"},{"v":99,"d":" 99"},{"v":77,"d":" 77"},{"v":106,"d":" 106"},{"v":15,"d":"+ 15"},{"v":31,"d":"+ 31"},{"v":29,"d":"+ 29"}]
[null,462,{"$f":"VLOOKUP(B62,AGS_Namen!$C$1:$D$58,2,FALSE)","v":"Wittmund"},{"v":27,"d":" 27"},{"v":27,"d":" 27"},{"v":21,"d":" 21"},{"v":11,"d":" 11"},{"v":12,"d":" 12"},{"v":30,"d":" 30"},{"v":12,"d":" 12"},{"v":38,"d":" 38"},{"v":29,"d":" 29"},{"v":15,"d":" 15"},{"v":25,"d":" 25"},{"v":18,"d":" 18"},{"v":21,"d":" 21"},{"v":21,"d":" 21"},{"v":50,"d":" 50"},{"v":23,"d":"+ 23"},{"v":20,"d":"+ 20"},{"v":29,"d":"+ 29"}]
[null,4,{"$f":"VLOOKUP(B63,AGS_Namen!$C$1:$D$58,2,FALSE)","v":"Stat. Region Weser-Ems"},{"v":2644,"d":"2 644"},{"v":2992,"d":"2 992"},{"v":2453,"d":"2 453"},{"v":2012,"d":"2 012"},{"v":1972,"d":"1 972"},{"v":2175,"d":"2 175"},{"v":2227,"d":"2 227"},{"v":2207,"d":"2 207"},{"v":2279,"d":"2 279"},{"v":2101,"d":"2 101"},{"v":2165,"d":"2 165"},{"v":2316,"d":"2 316"},{"v":2389,"d":"2 389"},{"v":2310,"d":"2 310"},{"v":3079,"d":"3 079"},{"v":435,"d":"+ 435"},{"v":904,"d":"+ 904"},{"v":769,"d":"+ 769"}]
[null,0,{"$f":"VLOOKUP(B64,AGS_Namen!$C$1:$D$58,2,FALSE)","v":"Niedersachsen"},{"v":10886,"d":"10 886"},{"v":11441,"d":"11 441"},{"v":9251,"d":"9 251"},{"v":7704,"d":"7 704"},{"v":7223,"d":"7 223"},{"v":7363,"d":"7 363"},{"v":7995,"d":"7 995"},{"v":8526,"d":"8 526"},{"v":8216,"d":"8 216"},{"v":7722,"d":"7 722"},{"v":7988,"d":"7 988"},{"v":8519,"d":"8 519"},{"v":8785,"d":"8 785"},{"v":8470,"d":"8 470"},{"v":10932,"d":"10 932"},{"v":46,"d":"+ 46"},{"v":3569,"d":"+3 569"},{"v":2462,"d":"+2 462"}]
[]
[null,null,"Quelle: Einbürgerungsstatistik"]
[null,null,"Karte A15-2: Veränderung der Zahl der Einbürgerungen von 2019 gegenüber 2018 in Prozent"]
{"$rows_empty":44}
[null,null,{"$f":"Def","v":"Die Definition zu dem Indikator sowie methodische Hinweise finden Sie in der Tabelle Aktuelle Ergebnisse"}]
[null,null,"Link zur LSN-Online-Datenbank"]

{"sheet":"A17","index":15,"n_rows":171,"n_cols":18,"rows_kept":171,"merged":[[2,2,2,4],[9,2,11,2],[9,3,9,17],[11,3,11,17],[70,2,72,2],[70,3,70,17],[72,3,72,17],[129,2,129,13],[169,2,169,13],[170,2,170,13]]}
[null,null,{"$f":"Kopf","v":"Migration und Teilhabe in Niedersachsen - Integrationsmonitoring 2020 - Regionalinformationen "}]
[]
[]
[]
[null,null,"Indikator A17: Lebendgeborene Deutsche und Ausländerinnen und Ausländer in Niedersachsen"]
[null,null,"Tabelle A17-2-1: Lebendgeborene Ausländerinnen und Ausländer 2005 bis 2019 (31.12.) nach Kreisen"]
[]
[]
[]
[null,null,"Land\nStatistische Region","Lebendgeborene Ausländerinnen und Ausländer am 31.12."]
[{"$nulls":3},2005,2006,2007,2008,2009,2010,2011,2012,2013,2014,2015,2016,2017,2018,2019]
[{"$nulls":3},"Anzahl"]
[null,"Spalte1","1","  2","  3","  4","  5","  6","  7","  8","  9","  10","  11","  12","  13","  14","  15","  16"]
[null,101,{"$f":"VLOOKUP(Datenbereich_A17_1[[#This Row],[Spalte1]],AGS_Namen!$C$1:$D$58,2,FALSE)","v":"Braunschweig, Stadt"},{"v":84,"d":"  84"},{"v":72,"d":"  72"},{"v":82,"d":"  82"},{"v":67,"d":"  67"},{"v":63,"d":"  63"},{"v":87,"d":"  87"},{"v":84,"d":"  84"},{"v":110,"d":"  110"},{"v":117,"d":"  117"},{"v":138,"d":"  138"},{"v":167,"d":"  167"},{"v":222,"d":"  222"},{"v":185,"d":"  185"},{"v":232,"d":"  232"},{"v":239,"d":"  239"}]
[null,102,{"$f":"VLOOKUP(Datenbereich_A17_1[[#This Row],[Spalte1]],AGS_Namen!$C$1:$D$58,2,FALSE)","v":"Salzgitter, Stadt"},{"v":41,"d":"  41"},{"v":37,"d":"  37"},{"v":32,"d":"  32"},{"v":32,"d":"  32"},{"v":20,"d":"  20"},{"v":27,"d":"  27"},{"v":28,"d":"  28"},{"v":22,"d":"  22"},{"v":43,"d":"  43"},{"v":71,"d":"  71"},{"v":90,"d":"  90"},{"v":210,"d":"  210"},{"v":266,"d":"  266"},{"v":336,"d":"  336"},{"v":292,"d":"  292"}]
[null,103,{"$f":"VLOOKUP(Datenbereich_A17_1[[#This Row],[Spalte1]],AGS_Namen!$C$1:$D$58,2,FALSE)","v":"Wolfsburg, Stadt"},{"v":42,"d":"  42"},{"v":49,"d":"  49"},{"v":43,"d":"  43"},{"v":50,"d":"  50"},{"v":28,"d":"  28"},{"v":45,"d":"  45"},{"v":53,"d":"  53"},{"v":60,"d":"  60"},{"v":73,"d":"  73"},{"v":99,"d":"  99"},{"v":143,"d":"  143"},{"v":208,"d":"  208"},{"v":158,"d":"  158"},{"v":184,"d":"  184"},{"v":187,"d":"  187"}]
[null,151,{"$f":"VLOOKUP(Datenbereich_A17_1[[#This Row],[Spalte1]],AGS_Namen!$C$1:$D$58,2,FALSE)","v":"Gifhorn"},{"v":12,"d":"  12"},{"v":8,"d":"  8"},{"v":11,"d":"  11"},{"v":34,"d":"  34"},{"v":12,"d":"  12"},{"v":8,"d":"  8"},{"v":4,"d":"  4"},{"v":35,"d":"  35"},{"v":31,"d":"  31"},{"v":62,"d":"  62"},{"v":86,"d":"  86"},{"v":106,"d":"  106"},{"v":115,"d":"  115"},{"v":129,"d":"  129"},{"v":128,"d":"  128"}]
[null,153,{"$f":"VLOOKUP(Datenbereich_A17_1[[#This Row],[Spalte1]],AGS_Namen!$C$1:$D$58,2,FALSE)","v":"Goslar"},{"v":44,"d":"  44"},{"v":44,"d":"  44"},{"v":28,"d":"  28"},{"v":39,"d":"  39"},{"v":43,"d":"  43"},{"v":32,"d":"  32"},{"v":39,"d":"  39"},{"v":41,"d":"  41"},{"v":59,"d":"  59"},{"v":54,"d":"  54"},{"v":105,"d":"  105"},{"v":164,"d":"  164"},{"v":149,"d":"  149"},{"v":159,"d":"  159"},{"v":133,"d":"  133"}]
[null,154,{"$f":"VLOOKUP(Datenbereich_A17_1[[#This Row],[Spalte1]],AGS_Namen!$C$1:$D$58,2,FALSE)","v":"Helmstedt"},{"v":20,"d":"  20"},{"v":12,"d":"  12"},{"v":15,"d":"  15"},{"v":16,"d":"  16"},{"v":14,"d":"  14"},{"v":8,"d":"  8"},{"v":10,"d":"  10"},{"v":11,"d":"  11"},{"v":19,"d":"  19"},{"v":15,"d":"  15"},{"v":33,"d":"  33"},{"v":75,"d":"  75"},{"v":86,"d":"  86"},{"v":53,"d":"  53"},{"v":75,"d":"  75"}]
[null,155,{"$f":"VLOOKUP(Datenbereich_A17_1[[#This Row],[Spalte1]],AGS_Namen!$C$1:$D$58,2,FALSE)","v":"Northeim"},{"v":41,"d":"  41"},{"v":40,"d":"  40"},{"v":49,"d":"  49"},{"v":55,"d":"  55"},{"v":35,"d":"  35"},{"v":35,"d":"  35"},{"v":36,"d":"  36"},{"v":32,"d":"  32"},{"v":40,"d":"  40"},{"v":55,"d":"  55"},{"v":79,"d":"  79"},{"v":141,"d":"  141"},{"v":129,"d":"  129"},{"v":109,"d":"  109"},{"v":111,"d":"  111"}]
[null,157,{"$f":"VLOOKUP(Datenbereich_A17_1[[#This Row],[Spalte1]],AGS_Namen!$C$1:$D$58,2,FALSE)","v":"Peine"},{"v":38,"d":"  38"},{"v":29,"d":"  29"},{"v":27,"d":"  27"},{"v":28,"d":"  28"},{"v":23,"d":"  23"},{"v":26,"d":"  26"},{"v":30,"d":"  30"},{"v":38,"d":"  38"},{"v":28,"d":"  28"},{"v":43,"d":"  43"},{"v":70,"d":"  70"},{"v":121,"d":"  121"},{"v":112,"d":"  112"},{"v":109,"d":"  109"},{"v":128,"d":"  128"}]
[null,158,{"$f":"VLOOKUP(Datenbereich_A17_1[[#This Row],[Spalte1]],AGS_Namen!$C$1:$D$58,2,FALSE)","v":"Wolfenbüttel"},{"v":18,"d":"  18"},{"v":19,"d":"  19"},{"v":26,"d":"  26"},{"v":9,"d":"  9"},{"v":25,"d":"  25"},{"v":23,"d":"  23"},{"v":13,"d":"  13"},{"v":19,"d":"  19"},{"v":21,"d":"  21"},{"v":37,"d":"  37"},{"v":38,"d":"  38"},{"v":125,"d":"  125"},{"v":78,"d":"  78"},{"v":91,"d":"  91"},{"v":79,"d":"  79"}]
[null,159,{"$f":"VLOOKUP(Datenbereich_A17_1[[#This Row],[Spalte1]],AGS_Namen!$C$1:$D$58,2,FALSE)","v":"Göttingen"},{"v":128,"d":"  128"},{"v":114,"d":"  114"},{"v":113,"d":"  113"},{"v":117,"d":"  117"},{"v":115,"d":"  115"},{"v":127,"d":"  127"},{"v":126,"d":"  126"},{"v":150,"d":"  150"},{"v":158,"d":"  158"},{"v":185,"d":"  185"},{"v":202,"d":"  202"},{"v":337,"d":"  337"},{"v":310,"d":"  310"},{"v":346,"d":"  346"},{"v":287,"d":"  287"}]
[null,1,{"$f":"VLOOKUP(Datenbereich_A17_1[[#This Row],[Spalte1]],AGS_Namen!$C$1:$D$58,2,FALSE)","v":"Stat. Region Braunschweig"},{"v":468,"d":"  468"},{"v":424,"d":"  424"},{"v":426,"d":"  426"},{"v":447,"d":"  447"},{"v":378,"d":"  378"},{"v":418,"d":"  418"},{"v":423,"d":"  423"},{"v":518,"d":"  518"},{"v":589,"d":"  589"},{"v":759,"d":"  759"},{"v":1013,"d":" 1 013"},{"v":1709,"d":" 1 709"},{"v":1588,"d":" 1 588"},{"v":1748,"d":" 1 748"},{"v":1659,"d":" 1 659"}]
[null,241,{"$f":"VLOOKUP(Datenbereich_A17_1[[#This Row],[Spalte1]],AGS_Namen!$C$1:$D$58,2,FALSE)","v":"Hannover, Region"},{"v":404,"d":"  404"},{"v":467,"d":"  467"},{"v":421,"d":"  421"},{"v":395,"d":"  395"},{"v":394,"d":"  394"},{"v":397,"d":"  397"},{"v":415,"d":"  415"},{"v":466,"d":"  466"},{"v":531,"d":"  531"},{"v":770,"d":"  770"},{"v":933,"d":"  933"},{"v":1603,"d":" 1 603"},{"v":1490,"d":" 1 490"},{"v":1596,"d":" 1 596"},{"v":1360,"d":" 1 360"}]
[null,241001,{"$f":"VLOOKUP(Datenbereich_A17_1[[#This Row],[Spalte1]],AGS_Namen!$C$1:$D$58,2,FALSE)","v":"   dav. Hannover, Lhst."},{"v":270,"d":"  270"},{"v":293,"d":"  293"},{"v":262,"d":"  262"},{"v":237,"d":"  237"},{"v":246,"d":"  246"},{"v":258,"d":"  258"},{"v":284,"d":"  284"},{"v":335,"d":"  335"},{"v":351,"d":"  351"},{"v":493,"d":"  493"},{"v":569,"d":"  569"},{"v":831,"d":"  831"},{"v":779,"d":"  779"},{"v":870,"d":"  870"},{"v":798,"d":"  798"}]
[null,241999,{"$f":"VLOOKUP(Datenbereich_A17_1[[#This Row],[Spalte1]],AGS_Namen!$C$1:$D$58,2,FALSE)","v":"   dav. Hannover, Umland"},{"v":134,"d":"  134"},{"v":174,"d":"  174"},{"v":159,"d":"  159"},{"v":158,"d":"  158"},{"v":148,"d":"  148"},{"v":139,"d":"  139"},{"v":131,"d":"  131"},{"v":131,"d":"  131"},{"v":180,"d":"  180"},{"v":277,"d":"  277"},{"v":364,"d":"  364"},{"v":772,"d":"  772"},{"v":711,"d":"  711"},{"v":726,"d":"  726"},{"v":562,"d":"  562"}]
[null,251,{"$f":"VLOOKUP(Datenbereich_A17_1[[#This Row],[Spalte1]],AGS_Namen!$C$1:$D$58,2,FALSE)","v":"Diepholz"},{"v":50,"d":"  50"},{"v":48,"d":"  48"},{"v":43,"d":"  43"},{"v":61,"d":"  61"},{"v":61,"d":"  61"},{"v":54,"d":"  54"},{"v":45,"d":"  45"},{"v":58,"d":"  58"},{"v":75,"d":"  75"},{"v":102,"d":"  102"},{"v":127,"d":"  127"},{"v":232,"d":"  232"},{"v":240,"d":"  240"},{"v":233,"d":"  233"},{"v":218,"d":"  218"}]
[null,252,{"$f":"VLOOKUP(Datenbereich_A17_1[[#This Row],[Spalte1]],AGS_Namen!$C$1:$D$58,2,FALSE)","v":"Hameln-Pyrmont"},{"v":35,"d":"  35"},{"v":64,"d":"  64"},{"v":66,"d":"  66"},{"v":75,"d":"  75"},{"v":39,"d":"  39"},{"v":39,"d":"  39"},{"v":43,"d":"  43"},{"v":64,"d":"  64"},{"v":73,"d":"  73"},{"v":101,"d":"  101"},{"v":109,"d":"  109"},{"v":197,"d":"  197"},{"v":174,"d":"  174"},{"v":200,"d":"  200"},{"v":198,"d":"  198"}]
[null,254,{"$f":"VLOOKUP(Datenbereich_A17_1[[#This Row],[Spalte1]],AGS_Namen!$C$1:$D$58,2,FALSE)","v":"Hildesheim"},{"v":118,"d":"  118"},{"v":107,"d":"  107"},{"v":111,"d":"  111"},{"v":109,"d":"  109"},{"v":82,"d":"  82"},{"v":91,"d":"  91"},{"v":90,"d":"  90"},{"v":93,"d":"  93"},{"v":120,"d":"  120"},{"v":124,"d":"  124"},{"v":163,"d":"  163"},{"v":284,"d":"  284"},{"v":226,"d":"  226"},{"v":270,"d":"  270"},{"v":262,"d":"  262"}]
[null,255,{"$f":"VLOOKUP(Datenbereich_A17_1[[#This Row],[Spalte1]],AGS_Namen!$C$1:$D$58,2,FALSE)","v":"Holzminden"},{"v":13,"d":"  13"},{"v":16,"d":"  16"},{"v":18,"d":"  18"},{"v":10,"d":"  10"},{"v":14,"d":"  14"},{"v":14,"d":"  14"},{"v":14,"d":"  14"},{"v":11,"d":"  11"},{"v":9,"d":"  9"},{"v":20,"d":"  20"},{"v":38,"d":"  38"},{"v":71,"d":"  71"},{"v":61,"d":"  61"},{"v":52,"d":"  52"},{"v":50,"d":"  50"}]
[null,256,{"$f":"VLOOKUP(Datenbereich_A17_1[[#This Row],[Spalte1]],AGS_Namen!$C$1:$D$58,2,FALSE)","v":"Nienburg (Weser)"},{"v":48,"d":"  48"},{"v":36,"d":"  36"},{"v":29,"d":"  29"},{"v":34,"d":"  34"},{"v":19,"d":"  19"},{"v":15,"d":"  15"},{"v":12,"d":"  12"},{"v":24,"d":"  24"},{"v":35,"d":"  35"},{"v":27,"d":"  27"},{"v":58,"d":"  58"},{"v":154,"d":"  154"},{"v":116,"d":"  116"},{"v":109,"d":"  109"},{"v":142,"d":"  142"}]
[null,257,{"$f":"VLOOKUP(Datenbereich_A17_1[[#This Row],[Spalte1]],AGS_Namen!$C$1:$D$58,2,FALSE)","v":"Schaumburg"},{"v":33,"d":"  33"},{"v":33,"d":"  33"},{"v":47,"d":"  47"},{"v":50,"d":"  50"},{"v":6,"d":"  6"},{"v":12,"d":"  12"},{"v":6,"d":"  6"},{"v":27,"d":"  27"},{"v":49,"d":"  49"},{"v":85,"d":"  85"},{"v":83,"d":"  83"},{"v":166,"d":"  166"},{"v":155,"d":"  155"},{"v":195,"d":"  195"},{"v":139,"d":"  139"}]
[null,2,{"$f":"VLOOKUP(Datenbereich_A17_1[[#This Row],[Spalte1]],AGS_Namen!$C$1:$D$58,2,FALSE)","v":"Stat. Region Hannover"},{"v":701,"d":"  701"},{"v":771,"d":"  771"},{"v":735,"d":"  735"},{"v":734,"d":"  734"},{"v":615,"d":"  615"},{"v":622,"d":"  622"},{"v":625,"d":"  625"},{"v":743,"d":"  743"},{"v":892,"d":"  892"},{"v":1229,"d":" 1 229"},{"v":1511,"d":" 1 511"},{"v":2707,"d":" 2 707"},{"v":2462,"d":" 2 462"},{"v":2655,"d":" 2 655"},{"v":2369,"d":" 2 369"}]
[null,351,{"$f":"VLOOKUP(Datenbereich_A17_1[[#This Row],[Spalte1]],AGS_Namen!$C$1:$D$58,2,FALSE)","v":"Celle"},{"v":40,"d":"  40"},{"v":29,"d":"  29"},{"v":35,"d":"  35"},{"v":33,"d":"  33"},{"v":32,"d":"  32"},{"v":33,"d":"  33"},{"v":40,"d":"  40"},{"v":30,"d":"  30"},{"v":67,"d":"  67"},{"v":97,"d":"  97"},{"v":87,"d":"  87"},{"v":182,"d":"  182"},{"v":168,"d":"  168"},{"v":176,"d":"  176"},{"v":160,"d":"  160"}]
[null,352,{"$f":"VLOOKUP(Datenbereich_A17_1[[#This Row],[Spalte1]],AGS_Namen!$C$1:$D$58,2,FALSE)","v":"Cuxhaven"},{"v":45,"d":"  45"},{"v":44,"d":"  44"},{"v":49,"d":"  49"},{"v":44,"d":"  44"},{"v":47,"d":"  47"},{"v":47,"d":"  47"},{"v":45,"d":"  45"},{"v":41,"d":"  41"},{"v":48,"d":"  48"},{"v":83,"d":"  83"},{"v":84,"d":"  84"},{"v":168,"d":"  168"},{"v":165,"d":"  165"},{"v":143,"d":"  143"},{"v":131,"d":"  131"}]
[null,353,{"$f":"VLOOKUP(Datenbereich_A17_1[[#This Row],[Spalte1]],AGS_Namen!$C$1:$D$58,2,FALSE)","v":"Harburg"},{"v":55,"d":"  55"},{"v":47,"d":"  47"},{"v":60,"d":"  60"},{"v":62,"d":"  62"},{"v":58,"d":"  58"},{"v":60,"d":"  60"},{"v":44,"d":"  44"},{"v":42,"d":"  42"},{"v":67,"d":"  67"},{"v":84,"d":"  84"},{"v":90,"d":"  90"},{"v":128,"d":"  128"},{"v":157,"d":"  157"},{"v":149,"d":"  149"},{"v":185,"d":"  185"}]
[null,354,{"$f":"VLOOKUP(Datenbereich_A17_1[[#This Row],[Spalte1]],AGS_Namen!$C$1:$D$58,2,FALSE)","v":"Lüchow-Dannenberg"},{"v":5,"d":"  5"},{"v":10,"d":"  10"},{"v":10,"d":"  10"},{"v":3,"d":"  3"},{"v":10,"d":"  10"},{"v":4,"d":"  4"},{"v":5,"d":"  5"},{"v":9,"d":"  9"},{"v":15,"d":"  15"},{"v":22,"d":"  22"},{"v":35,"d":"  35"},{"v":52,"d":"  52"},{"v":30,"d":"  30"},{"v":41,"d":"  41"},{"v":30,"d":"  30"}]
[null,355,{"$f":"VLOOKUP(Datenbereich_A17_1[[#This Row],[Spalte1]],AGS_Namen!$C$1:$D$58,2,FALSE)","v":"Lüneburg"},{"v":42,"d":"  42"},{"v":29,"d":"  29"},{"v":33,"d":"  33"},{"v":21,"d":"  21"},{"v":29,"d":"  29"},{"v":21,"d":"  21"},{"v":32,"d":"  32"},{"v":30,"d":"  30"},{"v":39,"d":"  39"},{"v":52,"d":"  52"},{"v":62,"d":"  62"},{"v":168,"d":"  168"},{"v":126,"d":"  126"},{"v":111,"d":"  111"},{"v":146,"d":"  146"}]
[null,356,{"$f":"VLOOKUP(Datenbereich_A17_1[[#This Row],[Spalte1]],AGS_Namen!$C$1:$D$58,2,FALSE)","v":"Osterholz"},{"v":42,"d":"  42"},{"v":28,"d":"  28"},{"v":29,"d":"  29"},{"v":22,"d":"  22"},{"v":22,"d":"  22"},{"v":24,"d":"  24"},{"v":14,"d":"  14"},{"v":14,"d":"  14"},{"v":30,"d":"  30"},{"v":42,"d":"  42"},{"v":60,"d":"  60"},{"v":106,"d":"  106"},{"v":72,"d":"  72"},{"v":62,"d":"  62"},{"v":82,"d":"  82"}]
[null,357,{"$f":"VLOOKUP(Datenbereich_A17_1[[#This Row],[Spalte1]],AGS_Namen!$C$1:$D$58,2,FALSE)","v":"Rotenburg (Wümme)"},{"v":37,"d":"  37"},{"v":41,"d":"  41"},{"v":38,"d":"  38"},{"v":23,"d":"  23"},{"v":11,"d":"  11"},{"v":10,"d":"  10"},{"v":10,"d":"  10"},{"v":27,"d":"  27"},{"v":41,"d":"  41"},{"v":58,"d":"  58"},{"v":62,"d":"  62"},{"v":125,"d":"  125"},{"v":122,"d":"  122"},{"v":100,"d":"  100"},{"v":105,"d":"  105"}]
[null,358,{"$f":"VLOOKUP(Datenbereich_A17_1[[#This Row],[Spalte1]],AGS_Namen!$C$1:$D$58,2,FALSE)","v":"Heidekreis"},{"v":42,"d":"  42"},{"v":40,"d":"  40"},{"v":23,"d":"  23"},{"v":22,"d":"  22"},{"v":22,"d":"  22"},{"v":18,"d":"  18"},{"v":18,"d":"  18"},{"v":22,"d":"  22"},{"v":49,"d":"  49"},{"v":67,"d":"  67"},{"v":95,"d":"  95"},{"v":160,"d":"  160"},{"v":124,"d":"  124"},{"v":160,"d":"  160"},{"v":185,"d":"  185"}]
[null,359,{"$f":"VLOOKUP(Datenbereich_A17_1[[#This Row],[Spalte1]],AGS_Namen!$C$1:$D$58,2,FALSE)","v":"Stade"},{"v":43,"d":"  43"},{"v":50,"d":"  50"},{"v":31,"d":"  31"},{"v":38,"d":"  38"},{"v":48,"d":"  48"},{"v":29,"d":"  29"},{"v":26,"d":"  26"},{"v":44,"d":"  44"},{"v":53,"d":"  53"},{"v":90,"d":"  90"},{"v":127,"d":"  127"},{"v":243,"d":"  243"},{"v":222,"d":"  222"},{"v":251,"d":"  251"},{"v":218,"d":"  218"}]
[null,360,{"$f":"VLOOKUP(Datenbereich_A17_1[[#This Row],[Spalte1]],AGS_Namen!$C$1:$D$58,2,FALSE)","v":"Uelzen"},{"v":28,"d":"  28"},{"v":25,"d":"  25"},{"v":20,"d":"  20"},{"v":21,"d":"  21"},{"v":21,"d":"  21"},{"v":21,"d":"  21"},{"v":17,"d":"  17"},{"v":17,"d":"  17"},{"v":19,"d":"  19"},{"v":44,"d":"  44"},{"v":53,"d":"  53"},{"v":71,"d":"  71"},{"v":52,"d":"  52"},{"v":67,"d":"  67"},{"v":57,"d":"  57"}]
[null,361,{"$f":"VLOOKUP(Datenbereich_A17_1[[#This Row],[Spalte1]],AGS_Namen!$C$1:$D$58,2,FALSE)","v":"Verden"},{"v":44,"d":"  44"},{"v":28,"d":"  28"},{"v":46,"d":"  46"},{"v":33,"d":"  33"},{"v":19,"d":"  19"},{"v":22,"d":"  22"},{"v":20,"d":"  20"},{"v":34,"d":"  34"},{"v":35,"d":"  35"},{"v":38,"d":"  38"},{"v":58,"d":"  58"},{"v":132,"d":"  132"},{"v":110,"d":"  110"},{"v":127,"d":"  127"},{"v":113,"d":"  113"}]
[null,3,{"$f":"VLOOKUP(Datenbereich_A17_1[[#This Row],[Spalte1]],AGS_Namen!$C$1:$D$58,2,FALSE)","v":"Stat. Region Lüneburg"},{"v":423,"d":"  423"},{"v":371,"d":"  371"},{"v":374,"d":"  374"},{"v":322,"d":"  322"},{"v":319,"d":"  319"},{"v":289,"d":"  289"},{"v":271,"d":"  271"},{"v":310,"d":"  310"},{"v":463,"d":"  463"},{"v":677,"d":"  677"},{"v":813,"d":"  813"},{"v":1535,"d":" 1 535"},{"v":1348,"d":" 1 348"},{"v":1387,"d":" 1 387"},{"v":1412,"d":" 1 412"}]
[null,401,{"$f":"VLOOKUP(Datenbereich_A17_1[[#This Row],[Spalte1]],AGS_Namen!$C$1:$D$58,2,FALSE)","v":"Delmenhorst, Stadt"},{"v":18,"d":"  18"},{"v":16,"d":"  16"},{"v":28,"d":"  28"},{"v":25,"d":"  25"},{"v":24,"d":"  24"},{"v":29,"d":"  29"},{"v":20,"d":"  20"},{"v":46,"d":"  46"},{"v":23,"d":"  23"},{"v":50,"d":"  50"},{"v":83,"d":"  83"},{"v":180,"d":"  180"},{"v":202,"d":"  202"},{"v":184,"d":"  184"},{"v":186,"d":"  186"}]
[null,402,{"$f":"VLOOKUP(Datenbereich_A17_1[[#This Row],[Spalte1]],AGS_Namen!$C$1:$D$58,2,FALSE)","v":"Emden, Stadt"},{"v":14,"d":"  14"},{"v":15,"d":"  15"},{"v":16,"d":"  16"},{"v":17,"d":"  17"},{"v":17,"d":"  17"},{"v":12,"d":"  12"},{"v":13,"d":"  13"},{"v":16,"d":"  16"},{"v":26,"d":"  26"},{"v":29,"d":"  29"},{"v":40,"d":"  40"},{"v":80,"d":"  80"},{"v":68,"d":"  68"},{"v":79,"d":"  79"},{"v":77,"d":"  77"}]
[null,403,{"$f":"VLOOKUP(Datenbereich_A17_1[[#This Row],[Spalte1]],AGS_Namen!$C$1:$D$58,2,FALSE)","v":"Oldenburg (Oldb), Stadt"},{"v":101,"d":"  101"},{"v":97,"d":"  97"},{"v":95,"d":"  95"},{"v":80,"d":"  80"},{"v":101,"d":"  101"},{"v":113,"d":"  113"},{"v":84,"d":"  84"},{"v":107,"d":"  107"},{"v":105,"d":"  105"},{"v":136,"d":"  136"},{"v":140,"d":"  140"},{"v":211,"d":"  211"},{"v":221,"d":"  221"},{"v":223,"d":"  223"},{"v":214,"d":"  214"}]
[null,404,{"$f":"VLOOKUP(Datenbereich_A17_1[[#This Row],[Spalte1]],AGS_Namen!$C$1:$D$58,2,FALSE)","v":"Osnabrück, Stadt"},{"v":60,"d":"  60"},{"v":80,"d":"  80"},{"v":75,"d":"  75"},{"v":89,"d":"  89"},{"v":49,"d":"  49"},{"v":93,"d":"  93"},{"v":82,"d":"  82"},{"v":74,"d":"  74"},{"v":102,"d":"  102"},{"v":137,"d":"  137"},{"v":151,"d":"  151"},{"v":220,"d":"  220"},{"v":241,"d":"  241"},{"v":234,"d":"  234"},{"v":253,"d":"  253"}]
[null,405,{"$f":"VLOOKUP(Datenbereich_A17_1[[#This Row],[Spalte1]],AGS_Namen!$C$1:$D$58,2,FALSE)","v":"Wilhelmshaven, Stadt"},{"v":26,"d":"  26"},{"v":22,"d":"  22"},{"v":16,"d":"  16"},{"v":9,"d":"  9"},{"v":14,"d":"  14"},{"v":21,"d":"  21"},{"v":24,"d":"  24"},{"v":19,"d":"  19"},{"v":18,"d":"  18"},{"v":35,"d":"  35"},{"v":84,"d":"  84"},{"v":106,"d":"  106"},{"v":137,"d":"  137"},{"v":133,"d":"  133"},{"v":136,"d":"  136"}]
[null,451,{"$f":"VLOOKUP(Datenbereich_A17_1[[#This Row],[Spalte1]],AGS_Namen!$C$1:$D$58,2,FALSE)","v":"Ammerland"},{"v":14,"d":"  14"},{"v":16,"d":"  16"},{"v":20,"d":"  20"},{"v":22,"d":"  22"},{"v":19,"d":"  19"},{"v":12,"d":"  12"},{"v":27,"d":"  27"},{"v":29,"d":"  29"},{"v":25,"d":"  25"},{"v":37,"d":"  37"},{"v":63,"d":"  63"},{"v":119,"d":"  119"},{"v":94,"d":"  94"},{"v":104,"d":"  104"},{"v":95,"d":"  95"}]
[null,452,{"$f":"VLOOKUP(Datenbereich_A17_1[[#This Row],[Spalte1]],AGS_Namen!$C$1:$D$58,2,FALSE)","v":"Aurich"},{"v":43,"d":"  43"},{"v":37,"d":"  37"},{"v":60,"d":"  60"},{"v":33,"d":"  33"},{"v":30,"d":"  30"},{"v":9,"d":"  9"},{"v":14,"d":"  14"},{"v":30,"d":"  30"},{"v":43,"d":"  43"},{"v":62,"d":"  62"},{"v":97,"d":"  97"},{"v":162,"d":"  162"},{"v":153,"d":"  153"},{"v":138,"d":"  138"},{"v":132,"d":"  132"}]
[null,453,{"$f":"VLOOKUP(Datenbereich_A17_1[[#This Row],[Spalte1]],AGS_Namen!$C$1:$D$58,2,FALSE)","v":"Cloppenburg"},{"v":32,"d":"  32"},{"v":20,"d":"  20"},{"v":44,"d":"  44"},{"v":39,"d":"  39"},{"v":24,"d":"  24"},{"v":23,"d":"  23"},{"v":17,"d":"  17"},{"v":62,"d":"  62"},{"v":116,"d":"  116"},{"v":159,"d":"  159"},{"v":180,"d":"  180"},{"v":260,"d":"  260"},{"v":242,"d":"  242"},{"v":299,"d":"  299"},{"v":299,"d":"  299"}]
[null,454,{"$f":"VLOOKUP(Datenbereich_A17_1[[#This Row],[Spalte1]],AGS_Namen!$C$1:$D$58,2,FALSE)","v":"Emsland"},{"v":87,"d":"  87"},{"v":81,"d":"  81"},{"v":89,"d":"  89"},{"v":108,"d":"  108"},{"v":85,"d":"  85"},{"v":65,"d":"  65"},{"v":84,"d":"  84"},{"v":115,"d":"  115"},{"v":147,"d":"  147"},{"v":236,"d":"  236"},{"v":291,"d":"  291"},{"v":419,"d":"  419"},{"v":420,"d":"  420"},{"v":421,"d":"  421"},{"v":434,"d":"  434"}]
[null,455,{"$f":"VLOOKUP(Datenbereich_A17_1[[#This Row],[Spalte1]],AGS_Namen!$C$1:$D$58,2,FALSE)","v":"Friesland"},{"v":17,"d":"  17"},{"v":19,"d":"  19"},{"v":18,"d":"  18"},{"v":15,"d":"  15"},{"v":18,"d":"  18"},{"v":12,"d":"  12"},{"v":15,"d":"  15"},{"v":16,"d":"  16"},{"v":22,"d":"  22"},{"v":29,"d":"  29"},{"v":62,"d":"  62"},{"v":126,"d":"  126"},{"v":85,"d":"  85"},{"v":63,"d":"  63"},{"v":50,"d":"  50"}]
[null,456,{"$f":"VLOOKUP(Datenbereich_A17_1[[#This Row],[Spalte1]],AGS_Namen!$C$1:$D$58,2,FALSE)","v":"Grafschaft Bentheim"},{"v":57,"d":"  57"},{"v":86,"d":"  86"},{"v":109,"d":"  109"},{"v":100,"d":"  100"},{"v":92,"d":"  92"},{"v":87,"d":"  87"},{"v":56,"d":"  56"},{"v":74,"d":"  74"},{"v":79,"d":"  79"},{"v":108,"d":"  108"},{"v":132,"d":"  132"},{"v":185,"d":"  185"},{"v":156,"d":"  156"},{"v":160,"d":"  160"},{"v":148,"d":"  148"}]
[null,457,{"$f":"VLOOKUP(Datenbereich_A17_1[[#This Row],[Spalte1]],AGS_Namen!$C$1:$D$58,2,FALSE)","v":"Leer"},{"v":35,"d":"  35"},{"v":23,"d":"  23"},{"v":40,"d":"  40"},{"v":36,"d":"  36"},{"v":36,"d":"  36"},{"v":46,"d":"  46"},{"v":41,"d":"  41"},{"v":36,"d":"  36"},{"v":46,"d":"  46"},{"v":78,"d":"  78"},{"v":93,"d":"  93"},{"v":170,"d":"  170"},{"v":160,"d":"  160"},{"v":183,"d":"  183"},{"v":196,"d":"  196"}]
[null,458,{"$f":"VLOOKUP(Datenbereich_A17_1[[#This Row],[Spalte1]],AGS_Namen!$C$1:$D$58,2,FALSE)","v":"Oldenburg"},{"v":28,"d":"  28"},{"v":15,"d":"  15"},{"v":30,"d":"  30"},{"v":28,"d":"  28"},{"v":24,"d":"  24"},{"v":25,"d":"  25"},{"v":21,"d":"  21"},{"v":43,"d":"  43"},{"v":64,"d":"  64"},{"v":80,"d":"  80"},{"v":83,"d":"  83"},{"v":155,"d":"  155"},{"v":132,"d":"  132"},{"v":136,"d":"  136"},{"v":138,"d":"  138"}]
[null,459,{"$f":"VLOOKUP(Datenbereich_A17_1[[#This Row],[Spalte1]],AGS_Namen!$C$1:$D$58,2,FALSE)","v":"Osnabrück"},{"v":61,"d":"  61"},{"v":59,"d":"  59"},{"v":87,"d":"  87"},{"v":83,"d":"  83"},{"v":69,"d":"  69"},{"v":75,"d":"  75"},{"v":65,"d":"  65"},{"v":81,"d":"  81"},{"v":107,"d":"  107"},{"v":185,"d":"  185"},{"v":199,"d":"  199"},{"v":335,"d":"  335"},{"v":341,"d":"  341"},{"v":350,"d":"  350"},{"v":385,"d":"  385"}]
[null,460,{"$f":"VLOOKUP(Datenbereich_A17_1[[#This Row],[Spalte1]],AGS_Namen!$C$1:$D$58,2,FALSE)","v":"Vechta"},{"v":86,"d":"  86"},{"v":92,"d":"  92"},{"v":86,"d":"  86"},{"v":88,"d":"  88"},{"v":63,"d":"  63"},{"v":62,"d":"  62"},{"v":53,"d":"  53"},{"v":90,"d":"  90"},{"v":113,"d":"  113"},{"v":171,"d":"  171"},{"v":212,"d":"  212"},{"v":279,"d":"  279"},{"v":239,"d":"  239"},{"v":235,"d":"  235"},{"v":263,"d":"  263"}]
[null,461,{"$f":"VLOOKUP(Datenbereich_A17_1[[#This Row],[Spalte1]],AGS_Namen!$C$1:$D$58,2,FALSE)","v":"Wesermarsch"},{"v":17,"d":"  17"},{"v":16,"d":"  16"},{"v":28,"d":"  28"},{"v":26,"d":"  26"},{"v":19,"d":"  19"},{"v":17,"d":"  17"},{"v":19,"d":"  19"},{"v":18,"d":"  18"},{"v":27,"d":"  27"},{"v":33,"d":"  33"},{"v":50,"d":"  50"},{"v":94,"d":"  94"},{"v":79,"d":"  79"},{"v":84,"d":"  84"},{"v":72,"d":"  72"}]
[null,462,{"$f":"VLOOKUP(Datenbereich_A17_1[[#This Row],[Spalte1]],AGS_Namen!$C$1:$D$58,2,FALSE)","v":"Wittmund"},{"v":16,"d":"  16"},{"v":14,"d":"  14"},{"v":9,"d":"  9"},{"v":17,"d":"  17"},{"v":9,"d":"  9"},{"v":9,"d":"  9"},{"v":12,"d":"  12"},{"v":12,"d":"  12"},{"v":9,"d":"  9"},{"v":18,"d":"  18"},{"v":25,"d":"  25"},{"v":41,"d":"  41"},{"v":36,"d":"  36"},{"v":23,"d":"  23"},{"v":29,"d":"  29"}]
[null,4,{"$f":"VLOOKUP(Datenbereich_A17_1[[#This Row],[Spalte1]],AGS_Namen!$C$1:$D$58,2,FALSE)","v":"Stat. Region Weser-Ems"},{"v":712,"d":"  712"},{"v":708,"d":"  708"},{"v":850,"d":"  850"},{"v":815,"d":"  815"},{"v":693,"d":"  693"},{"v":710,"d":"  710"},{"v":647,"d":"  647"},{"v":868,"d":"  868"},{"v":1072,"d":" 1 072"},{"v":1583,"d":" 1 583"},{"v":1985,"d":" 1 985"},{"v":3142,"d":" 3 142"},{"v":3006,"d":" 3 006"},{"v":3049,"d":" 3 049"},{"v":3107,"d":" 3 107"}]
[null,0,{"$f":"VLOOKUP(Datenbereich_A17_1[[#This Row],[Spalte1]],AGS_Namen!$C$1:$D$58,2,FALSE)","v":"Niedersachsen"},{"v":2304,"d":" 2 304"},{"v":2274,"d":" 2 274"},{"v":2385,"d":" 2 385"},{"v":2318,"d":" 2 318"},{"v":2005,"d":" 2 005"},{"v":2039,"d":" 2 039"},{"v":1966,"d":" 1 966"},{"v":2439,"d":" 2 439"},{"v":3016,"d":" 3 016"},{"v":4248,"d":" 4 248"},{"v":5322,"d":" 5 322"},{"v":9093,"d":" 9 093"},{"v":8404,"d":" 8 404"},{"v":8839,"d":" 8 839"},{"v":8547,"d":" 8 547"}]
[]
[null,null,"Quelle: Statistik der natürlichen Bevölkerungsbewegung"]
[]
[null,null,"Tabelle A17-2-2: Lebendgeborene Deutsche 2005 bis 2019 (31.12.) nach Kreisen"]
[]
[null,null,"Kreisfreie Stadt\nLandkreis\n(Großstadt, Umland)\nStatistische Region\nLand","Deutsche Lebendgeborene am 31.12."]
[{"$nulls":3},2005,2006,2007,2008,2009,2010,2011,2012,2013,2014,2015,2016,2017,2018,2019]
[{"$nulls":3},"Anzahl"]
[null,"Spalte1","1","2","3","4","5","6","7","8","9","10","11","12","13","14","15","16"]
[null,101,{"$f":"VLOOKUP(Datenbereich_A17_2[[#This Row],[Spalte1]],AGS_Namen!$C$1:$D$58,2,FALSE)","v":"Braunschweig, Stadt"},{"v":1968,"d":" 1 968"},{"v":1999,"d":" 1 999"},{"v":2110,"d":" 2 110"},{"v":2060,"d":" 2 060"},{"v":2050,"d":" 2 050"},{"v":2152,"d":" 2 152"},{"v":2134,"d":" 2 134"},{"v":2171,"d":" 2 171"},{"v":2117,"d":" 2 117"},{"v":2160,"d":" 2 160"},{"v":2241,"d":" 2 241"},{"v":2345,"d":" 2 345"},{"v":2178,"d":" 2 178"},{"v":2236,"d":" 2 236"},{"v":2192,"d":" 2 192"}]
[null,102,{"$f":"VLOOKUP(Datenbereich_A17_2[[#This Row],[Spalte1]],AGS_Namen!$C$1:$D$58,2,FALSE)","v":"Salzgitter, Stadt"},{"v":825,"d":"  825"},{"v":812,"d":"  812"},{"v":784,"d":"  784"},{"v":807,"d":"  807"},{"v":749,"d":"  749"},{"v":755,"d":"  755"},{"v":766,"d":"  766"},{"v":763,"d":"  763"},{"v":750,"d":"  750"},{"v":769,"d":"  769"},{"v":774,"d":"  774"},{"v":891,"d":"  891"},{"v":836,"d":"  836"},{"v":854,"d":"  854"},{"v":835,"d":"  835"}]
[null,103,{"$f":"VLOOKUP(Datenbereich_A17_2[[#This Row],[Spalte1]],AGS_Namen!$C$1:$D$58,2,FALSE)","v":"Wolfsburg, Stadt"},{"v":853,"d":"  853"},{"v":893,"d":"  893"},{"v":903,"d":"  903"},{"v":894,"d":"  894"},{"v":971,"d":"  971"},{"v":948,"d":"  948"},{"v":951,"d":"  951"},{"v":1019,"d":" 1 019"},{"v":1029,"d":" 1 029"},{"v":1097,"d":" 1 097"},{"v":1117,"d":" 1 117"},{"v":1224,"d":" 1 224"},{"v":1121,"d":" 1 121"},{"v":1146,"d":" 1 146"},{"v":1110,"d":" 1 110"}]
[null,151,{"$f":"VLOOKUP(Datenbereich_A17_2[[#This Row],[Spalte1]],AGS_Namen!$C$1:$D$58,2,FALSE)","v":"Gifhorn"},{"v":1537,"d":" 1 537"},{"v":1463,"d":" 1 463"},{"v":1509,"d":" 1 509"},{"v":1479,"d":" 1 479"},{"v":1383,"d":" 1 383"},{"v":1385,"d":" 1 385"},{"v":1268,"d":" 1 268"},{"v":1424,"d":" 1 424"},{"v":1386,"d":" 1 386"},{"v":1483,"d":" 1 483"},{"v":1474,"d":" 1 474"},{"v":1718,"d":" 1 718"},{"v":1534,"d":" 1 534"},{"v":1638,"d":" 1 638"},{"v":1655,"d":" 1 655"}]
[null,153,{"$f":"VLOOKUP(Datenbereich_A17_2[[#This Row],[Spalte1]],AGS_Namen!$C$1:$D$58,2,FALSE)","v":"Goslar"},{"v":940,"d":"  940"},{"v":914,"d":"  914"},{"v":903,"d":"  903"},{"v":943,"d":"  943"},{"v":824,"d":"  824"},{"v":847,"d":"  847"},{"v":763,"d":"  763"},{"v":743,"d":"  743"},{"v":768,"d":"  768"},{"v":832,"d":"  832"},{"v":832,"d":"  832"},{"v":823,"d":"  823"},{"v":808,"d":"  808"},{"v":801,"d":"  801"},{"v":796,"d":"  796"}]
[null,154,{"$f":"VLOOKUP(Datenbereich_A17_2[[#This Row],[Spalte1]],AGS_Namen!$C$1:$D$58,2,FALSE)","v":"Helmstedt"},{"v":673,"d":"673.0"},{"v":685,"d":"685.0"},{"v":712,"d":"712.0"},{"v":646,"d":"646.0"},{"v":586,"d":"586.0"},{"v":652,"d":"652.0"},{"v":546,"d":"546.0"},{"v":560,"d":"560.0"},{"v":652,"d":"652.0"},{"v":656,"d":"  656"},{"v":684,"d":"  684"},{"v":700,"d":"  700"},{"v":745,"d":"  745"},{"v":731,"d":"  731"},{"v":734,"d":"  734"}]
[null,155,{"$f":"VLOOKUP(Datenbereich_A17_2[[#This Row],[Spalte1]],AGS_Namen!$C$1:$D$58,2,FALSE)","v":"Northeim"},{"v":1037,"d":"1037.0"},{"v":984,"d":"984.0"},{"v":986,"d":"986.0"},{"v":991,"d":"991.0"},{"v":889,"d":"889.0"},{"v":931,"d":"931.0"},{"v":872,"d":"872.0"},{"v":872,"d":"872.0"},{"v":915,"d":"915.0"},{"v":941,"d":"  941"},{"v":904,"d":"  904"},{"v":927,"d":"  927"},{"v":895,"d":"  895"},{"v":896,"d":"  896"},{"v":920,"d":"  920"}]
[null,157,{"$f":"VLOOKUP(Datenbereich_A17_2[[#This Row],[Spalte1]],AGS_Namen!$C$1:$D$58,2,FALSE)","v":"Peine"},{"v":1089,"d":" 1 089"},{"v":1061,"d":" 1 061"},{"v":1013,"d":" 1 013"},{"v":1049,"d":" 1 049"},{"v":983,"d":"  983"},{"v":980,"d":"  980"},{"v":945,"d":"  945"},{"v":979,"d":"  979"},{"v":937,"d":"  937"},{"v":1026,"d":" 1 026"},{"v":974,"d":"  974"},{"v":1138,"d":" 1 138"},{"v":1116,"d":" 1 116"},{"v":1122,"d":" 1 122"},{"v":1119,"d":" 1 119"}]
[null,158,{"$f":"VLOOKUP(Datenbereich_A17_2[[#This Row],[Spalte1]],AGS_Namen!$C$1:$D$58,2,FALSE)","v":"Wolfenbüttel"},{"v":916,"d":"  916"},{"v":894,"d":"  894"},{"v":885,"d":"  885"},{"v":831,"d":"  831"},{"v":758,"d":"  758"},{"v":825,"d":"  825"},{"v":850,"d":"  850"},{"v":796,"d":"  796"},{"v":782,"d":"  782"},{"v":839,"d":"  839"},{"v":819,"d":"  819"},{"v":875,"d":"  875"},{"v":890,"d":"  890"},{"v":907,"d":"  907"},{"v":914,"d":"  914"}]
[null,159,{"$f":"VLOOKUP(Datenbereich_A17_2[[#This Row],[Spalte1]],AGS_Namen!$C$1:$D$58,2,FALSE)","v":"Göttingen"},{"v":2531,"d":" 2 531"},{"v":2487,"d":" 2 487"},{"v":2555,"d":" 2 555"},{"v":2380,"d":" 2 380"},{"v":2357,"d":" 2 357"},{"v":2303,"d":" 2 303"},{"v":2289,"d":" 2 289"},{"v":2236,"d":" 2 236"},{"v":2241,"d":" 2 241"},{"v":2440,"d":" 2 440"},{"v":2415,"d":" 2 415"},{"v":2650,"d":" 2 650"},{"v":2464,"d":" 2 464"},{"v":2525,"d":" 2 525"},{"v":2348,"d":" 2 348"}]
[null,1,{"$f":"VLOOKUP(Datenbereich_A17_2[[#This Row],[Spalte1]],AGS_Namen!$C$1:$D$58,2,FALSE)","v":"Stat. Region Braunschweig"},{"v":12369,"d":" 12 369"},{"v":12192,"d":" 12 192"},{"v":12360,"d":" 12 360"},{"v":12080,"d":" 12 080"},{"v":11550,"d":" 11 550"},{"v":11778,"d":" 11 778"},{"v":11384,"d":" 11 384"},{"v":11563,"d":" 11 563"},{"v":11577,"d":" 11 577"},{"v":12243,"d":" 12 243"},{"v":12234,"d":" 12 234"},{"v":13291,"d":" 13 291"},{"v":12587,"d":" 12 587"},{"v":12856,"d":" 12 856"},{"v":12623,"d":" 12 623"}]
[null,241,{"$f":"VLOOKUP(Datenbereich_A17_2[[#This Row],[Spalte1]],AGS_Namen!$C$1:$D$58,2,FALSE)","v":"Hannover, Region"},{"v":9082,"d":" 9 082"},{"v":9079,"d":" 9 079"},{"v":9328,"d":" 9 328"},{"v":9406,"d":" 9 406"},{"v":9130,"d":" 9 130"},{"v":9392,"d":" 9 392"},{"v":9302,"d":" 9 302"},{"v":9072,"d":" 9 072"},{"v":9427,"d":" 9 427"},{"v":9833,"d":" 9 833"},{"v":9645,"d":" 9 645"},{"v":10342,"d":" 10 342"},{"v":9855,"d":" 9 855"},{"v":9767,"d":" 9 767"},{"v":9538,"d":" 9 538"}]
[null,241001,{"$f":"VLOOKUP(Datenbereich_A17_2[[#This Row],[Spalte1]],AGS_Namen!$C$1:$D$58,2,FALSE)","v":"   dav. Hannover, Lhst."},{"v":4519,"d":" 4 519"},{"v":4537,"d":" 4 537"},{"v":4755,"d":" 4 755"},{"v":4732,"d":" 4 732"},{"v":4682,"d":" 4 682"},{"v":4848,"d":" 4 848"},{"v":4793,"d":" 4 793"},{"v":4609,"d":" 4 609"},{"v":4855,"d":" 4 855"},{"v":5142,"d":" 5 142"},{"v":4976,"d":" 4 976"},{"v":5228,"d":" 5 228"},{"v":4860,"d":" 4 860"},{"v":4767,"d":" 4 767"},{"v":4625,"d":" 4 625"}]
[null,241999,{"$f":"VLOOKUP(Datenbereich_A17_2[[#This Row],[Spalte1]],AGS_Namen!$C$1:$D$58,2,FALSE)","v":"   dav. Hannover, Umland"},{"v":4563,"d":" 4 563"},{"v":4542,"d":" 4 542"},{"v":4573,"d":" 4 573"},{"v":4674,"d":" 4 674"},{"v":4448,"d":" 4 448"},{"v":4544,"d":" 4 544"},{"v":4509,"d":" 4 509"},{"v":4463,"d":" 4 463"},{"v":4572,"d":" 4 572"},{"v":4691,"d":" 4 691"},{"v":4669,"d":" 4 669"},{"v":5114,"d":" 5 114"},{"v":4995,"d":" 4 995"},{"v":5000,"d":" 5 000"},{"v":4913,"d":" 4 913"}]
[null,251,{"$f":"VLOOKUP(Datenbereich_A17_2[[#This Row],[Spalte1]],AGS_Namen!$C$1:$D$58,2,FALSE)","v":"Diepholz"},{"v":1728,"d":" 1 728"},{"v":1630,"d":" 1 630"},{"v":1611,"d":" 1 611"},{"v":1637,"d":" 1 637"},{"v":1502,"d":" 1 502"},{"v":1554,"d":" 1 554"},{"v":1510,"d":" 1 510"},{"v":1471,"d":" 1 471"},{"v":1436,"d":" 1 436"},{"v":1579,"d":" 1 579"},{"v":1515,"d":" 1 515"},{"v":1734,"d":" 1 734"},{"v":1600,"d":" 1 600"},{"v":1620,"d":" 1 620"},{"v":1731,"d":" 1 731"}]
[null,252,{"$f":"VLOOKUP(Datenbereich_A17_2[[#This Row],[Spalte1]],AGS_Namen!$C$1:$D$58,2,FALSE)","v":"Hameln-Pyrmont"},{"v":1189,"d":" 1 189"},{"v":1111,"d":" 1 111"},{"v":1116,"d":" 1 116"},{"v":1120,"d":" 1 120"},{"v":1033,"d":" 1 033"},{"v":1010,"d":" 1 010"},{"v":1014,"d":" 1 014"},{"v":919,"d":"  919"},{"v":996,"d":"  996"},{"v":1006,"d":" 1 006"},{"v":1007,"d":" 1 007"},{"v":1109,"d":" 1 109"},{"v":1046,"d":" 1 046"},{"v":1044,"d":" 1 044"},{"v":1089,"d":" 1 089"}]
[null,254,{"$f":"VLOOKUP(Datenbereich_A17_2[[#This Row],[Spalte1]],AGS_Namen!$C$1:$D$58,2,FALSE)","v":"Hildesheim"},{"v":2221,"d":" 2 221"},{"v":2059,"d":" 2 059"},{"v":2071,"d":" 2 071"},{"v":2074,"d":" 2 074"},{"v":1900,"d":" 1 900"},{"v":1946,"d":" 1 946"},{"v":1851,"d":" 1 851"},{"v":1870,"d":" 1 870"},{"v":1931,"d":" 1 931"},{"v":1970,"d":" 1 970"},{"v":2025,"d":" 2 025"},{"v":2004,"d":" 2 004"},{"v":1960,"d":" 1 960"},{"v":2112,"d":" 2 112"},{"v":2077,"d":" 2 077"}]
[null,255,{"$f":"VLOOKUP(Datenbereich_A17_2[[#This Row],[Spalte1]],AGS_Namen!$C$1:$D$58,2,FALSE)","v":"Holzminden"},{"v":548,"d":"  548"},{"v":521,"d":"  521"},{"v":491,"d":"  491"},{"v":498,"d":"  498"},{"v":523,"d":"  523"},{"v":506,"d":"  506"},{"v":436,"d":"  436"},{"v":466,"d":"  466"},{"v":474,"d":"  474"},{"v":444,"d":"  444"},{"v":458,"d":"  458"},{"v":513,"d":"  513"},{"v":478,"d":"  478"},{"v":548,"d":"  548"},{"v":448,"d":"  448"}]
[null,256,{"$f":"VLOOKUP(Datenbereich_A17_2[[#This Row],[Spalte1]],AGS_Namen!$C$1:$D$58,2,FALSE)","v":"Nienburg (Weser)"},{"v":1035,"d":" 1 035"},{"v":982,"d":"  982"},{"v":979,"d":"  979"},{"v":959,"d":"  959"},{"v":900,"d":"  900"},{"v":949,"d":"  949"},{"v":919,"d":"  919"},{"v":835,"d":"  835"},{"v":908,"d":"  908"},{"v":859,"d":"  859"},{"v":912,"d":"  912"},{"v":949,"d":"  949"},{"v":923,"d":"  923"},{"v":914,"d":"  914"},{"v":923,"d":"  923"}]
[null,257,{"$f":"VLOOKUP(Datenbereich_A17_2[[#This Row],[Spalte1]],AGS_Namen!$C$1:$D$58,2,FALSE)","v":"Schaumburg"},{"v":1187,"d":" 1 187"},{"v":1276,"d":" 1 276"},{"v":1152,"d":" 1 152"},{"v":1121,"d":" 1 121"},{"v":1100,"d":" 1 100"},{"v":1109,"d":" 1 109"},{"v":1053,"d":" 1 053"},{"v":1027,"d":" 1 027"},{"v":1048,"d":" 1 048"},{"v":1056,"d":" 1 056"},{"v":1060,"d":" 1 060"},{"v":1191,"d":" 1 191"},{"v":1082,"d":" 1 082"},{"v":1117,"d":" 1 117"},{"v":1114,"d":" 1 114"}]
[null,2,{"$f":"VLOOKUP(Datenbereich_A17_2[[#This Row],[Spalte1]],AGS_Namen!$C$1:$D$58,2,FALSE)","v":"Stat. Region Hannover"},{"v":16990,"d":" 16 990"},{"v":16658,"d":" 16 658"},{"v":16748,"d":" 16 748"},{"v":16815,"d":" 16 815"},{"v":16088,"d":" 16 088"},{"v":16466,"d":" 16 466"},{"v":16085,"d":" 16 085"},{"v":15660,"d":" 15 660"},{"v":16220,"d":" 16 220"},{"v":16747,"d":" 16 747"},{"v":16622,"d":" 16 622"},{"v":17842,"d":" 17 842"},{"v":16944,"d":" 16 944"},{"v":17122,"d":" 17 122"},{"v":16920,"d":" 16 920"}]
[null,351,{"$f":"VLOOKUP(Datenbereich_A17_2[[#This Row],[Spalte1]],AGS_Namen!$C$1:$D$58,2,FALSE)","v":"Celle"},{"v":1602,"d":"1602.0"},{"v":1467,"d":"1467.0"},{"v":1438,"d":"1438.0"},{"v":1422,"d":"1422.0"},{"v":1399,"d":"1399.0"},{"v":1370,"d":"1370.0"},{"v":1355,"d":"1355.0"},{"v":1296,"d":"1296.0"},{"v":1313,"d":"1313.0"},{"v":1444,"d":" 1 444"},{"v":1420,"d":" 1 420"},{"v":1458,"d":" 1 458"},{"v":1431,"d":" 1 431"},{"v":1422,"d":" 1 422"},{"v":1483,"d":" 1 483"}]
[null,352,{"$f":"VLOOKUP(Datenbereich_A17_2[[#This Row],[Spalte1]],AGS_Namen!$C$1:$D$58,2,FALSE)","v":"Cuxhaven"},{"v":1438,"d":"1438.0"},{"v":1435,"d":"1435.0"},{"v":1457,"d":"1457.0"},{"v":1514,"d":"1514.0"},{"v":1424,"d":"1424.0"},{"v":1352,"d":"1352.0"},{"v":1358,"d":"1358.0"},{"v":1331,"d":"1331.0"},{"v":1430,"d":"1430.0"},{"v":1352,"d":" 1 352"},{"v":1384,"d":" 1 384"},{"v":1464,"d":" 1 464"},{"v":1495,"d":" 1 495"},{"v":1554,"d":" 1 554"},{"v":1390,"d":" 1 390"}]
[null,353,{"$f":"VLOOKUP(Datenbereich_A17_2[[#This Row],[Spalte1]],AGS_Namen!$C$1:$D$58,2,FALSE)","v":"Harburg"},{"v":1990,"d":" 1 990"},{"v":1843,"d":" 1 843"},{"v":1955,"d":" 1 955"},{"v":1952,"d":" 1 952"},{"v":1809,"d":" 1 809"},{"v":1802,"d":" 1 802"},{"v":1864,"d":" 1 864"},{"v":1850,"d":" 1 850"},{"v":1944,"d":" 1 944"},{"v":1974,"d":" 1 974"},{"v":2070,"d":" 2 070"},{"v":2151,"d":" 2 151"},{"v":2135,"d":" 2 135"},{"v":2144,"d":" 2 144"},{"v":2094,"d":" 2 094"}]
[null,354,{"$f":"VLOOKUP(Datenbereich_A17_2[[#This Row],[Spalte1]],AGS_Namen!$C$1:$D$58,2,FALSE)","v":"Lüchow-Dannenberg"},{"v":415,"d":"  415"},{"v":351,"d":"  351"},{"v":337,"d":"  337"},{"v":300,"d":"  300"},{"v":305,"d":"  305"},{"v":321,"d":"  321"},{"v":286,"d":"  286"},{"v":310,"d":"  310"},{"v":305,"d":"  305"},{"v":326,"d":"  326"},{"v":291,"d":"  291"},{"v":297,"d":"  297"},{"v":318,"d":"  318"},{"v":314,"d":"  314"},{"v":328,"d":"  328"}]
[null,355,{"$f":"VLOOKUP(Datenbereich_A17_2[[#This Row],[Spalte1]],AGS_Namen!$C$1:$D$58,2,FALSE)","v":"Lüneburg"},{"v":1445,"d":" 1 445"},{"v":1496,"d":" 1 496"},{"v":1479,"d":" 1 479"},{"v":1452,"d":" 1 452"},{"v":1467,"d":" 1 467"},{"v":1489,"d":" 1 489"},{"v":1411,"d":" 1 411"},{"v":1398,"d":" 1 398"},{"v":1537,"d":" 1 537"},{"v":1577,"d":" 1 577"},{"v":1481,"d":" 1 481"},{"v":1558,"d":" 1 558"},{"v":1521,"d":" 1 521"},{"v":1522,"d":" 1 522"},{"v":1510,"d":" 1 510"}]
[null,356,{"$f":"VLOOKUP(Datenbereich_A17_2[[#This Row],[Spalte1]],AGS_Namen!$C$1:$D$58,2,FALSE)","v":"Osterholz"},{"v":798,"d":"  798"},{"v":832,"d":"  832"},{"v":824,"d":"  824"},{"v":772,"d":"  772"},{"v":779,"d":"  779"},{"v":777,"d":"  777"},{"v":793,"d":"  793"},{"v":721,"d":"  721"},{"v":753,"d":"  753"},{"v":805,"d":"  805"},{"v":808,"d":"  808"},{"v":863,"d":"  863"},{"v":884,"d":"  884"},{"v":883,"d":"  883"},{"v":908,"d":"  908"}]
[null,357,{"$f":"VLOOKUP(Datenbereich_A17_2[[#This Row],[Spalte1]],AGS_Namen!$C$1:$D$58,2,FALSE)","v":"Rotenburg (Wümme)"},{"v":1424,"d":" 1 424"},{"v":1418,"d":" 1 418"},{"v":1418,"d":" 1 418"},{"v":1332,"d":" 1 332"},{"v":1318,"d":" 1 318"},{"v":1317,"d":" 1 317"},{"v":1191,"d":" 1 191"},{"v":1191,"d":" 1 191"},{"v":1168,"d":" 1 168"},{"v":1260,"d":" 1 260"},{"v":1253,"d":" 1 253"},{"v":1291,"d":" 1 291"},{"v":1307,"d":" 1 307"},{"v":1376,"d":" 1 376"},{"v":1370,"d":" 1 370"}]
[null,358,{"$f":"VLOOKUP(Datenbereich_A17_2[[#This Row],[Spalte1]],AGS_Namen!$C$1:$D$58,2,FALSE)","v":"Heidekreis"},{"v":1175,"d":" 1 175"},{"v":1178,"d":" 1 178"},{"v":1120,"d":" 1 120"},{"v":1094,"d":" 1 094"},{"v":1086,"d":" 1 086"},{"v":1134,"d":" 1 134"},{"v":1017,"d":" 1 017"},{"v":995,"d":"  995"},{"v":1016,"d":" 1 016"},{"v":991,"d":"  991"},{"v":1058,"d":" 1 058"},{"v":1032,"d":" 1 032"},{"v":1056,"d":" 1 056"},{"v":1091,"d":" 1 091"},{"v":1101,"d":" 1 101"}]
[null,359,{"$f":"VLOOKUP(Datenbereich_A17_2[[#This Row],[Spalte1]],AGS_Namen!$C$1:$D$58,2,FALSE)","v":"Stade"},{"v":1633,"d":" 1 633"},{"v":1672,"d":" 1 672"},{"v":1622,"d":" 1 622"},{"v":1635,"d":" 1 635"},{"v":1592,"d":" 1 592"},{"v":1698,"d":" 1 698"},{"v":1572,"d":" 1 572"},{"v":1514,"d":" 1 514"},{"v":1623,"d":" 1 623"},{"v":1573,"d":" 1 573"},{"v":1635,"d":" 1 635"},{"v":1741,"d":" 1 741"},{"v":1702,"d":" 1 702"},{"v":1704,"d":" 1 704"},{"v":1716,"d":" 1 716"}]
[null,360,{"$f":"VLOOKUP(Datenbereich_A17_2[[#This Row],[Spalte1]],AGS_Namen!$C$1:$D$58,2,FALSE)","v":"Uelzen"},{"v":713,"d":"  713"},{"v":727,"d":"  727"},{"v":685,"d":"  685"},{"v":649,"d":"  649"},{"v":632,"d":"  632"},{"v":647,"d":"  647"},{"v":602,"d":"  602"},{"v":611,"d":"  611"},{"v":610,"d":"  610"},{"v":629,"d":"  629"},{"v":591,"d":"  591"},{"v":623,"d":"  623"},{"v":652,"d":"  652"},{"v":633,"d":"  633"},{"v":671,"d":"  671"}]
[null,361,{"$f":"VLOOKUP(Datenbereich_A17_2[[#This Row],[Spalte1]],AGS_Namen!$C$1:$D$58,2,FALSE)","v":"Verden"},{"v":1113,"d":" 1 113"},{"v":1083,"d":" 1 083"},{"v":1102,"d":" 1 102"},{"v":1076,"d":" 1 076"},{"v":1046,"d":" 1 046"},{"v":1099,"d":" 1 099"},{"v":1002,"d":" 1 002"},{"v":1062,"d":" 1 062"},{"v":1074,"d":" 1 074"},{"v":1166,"d":" 1 166"},{"v":1169,"d":" 1 169"},{"v":1171,"d":" 1 171"},{"v":1266,"d":" 1 266"},{"v":1172,"d":" 1 172"},{"v":1156,"d":" 1 156"}]
[null,3,{"$f":"VLOOKUP(Datenbereich_A17_2[[#This Row],[Spalte1]],AGS_Namen!$C$1:$D$58,2,FALSE)","v":"Stat. Region Lüneburg"},{"v":13746,"d":" 13 746"},{"v":13502,"d":" 13 502"},{"v":13437,"d":" 13 437"},{"v":13198,"d":" 13 198"},{"v":12857,"d":" 12 857"},{"v":13006,"d":" 13 006"},{"v":12451,"d":" 12 451"},{"v":12279,"d":" 12 279"},{"v":12773,"d":" 12 773"},{"v":13097,"d":" 13 097"},{"v":13160,"d":" 13 160"},{"v":13649,"d":" 13 649"},{"v":13767,"d":" 13 767"},{"v":13815,"d":" 13 815"},{"v":13727,"d":" 13 727"}]
[null,401,{"$f":"VLOOKUP(Datenbereich_A17_2[[#This Row],[Spalte1]],AGS_Namen!$C$1:$D$58,2,FALSE)","v":"Delmenhorst, Stadt"},{"v":604,"d":"  604"},{"v":623,"d":"  623"},{"v":574,"d":"  574"},{"v":583,"d":"  583"},{"v":520,"d":"  520"},{"v":565,"d":"  565"},{"v":584,"d":"  584"},{"v":559,"d":"  559"},{"v":550,"d":"  550"},{"v":643,"d":"  643"},{"v":632,"d":"  632"},{"v":673,"d":"  673"},{"v":656,"d":"  656"},{"v":641,"d":"  641"},{"v":663,"d":"  663"}]
[null,402,{"$f":"VLOOKUP(Datenbereich_A17_2[[#This Row],[Spalte1]],AGS_Namen!$C$1:$D$58,2,FALSE)","v":"Emden, Stadt"},{"v":390,"d":"  390"},{"v":430,"d":"  430"},{"v":398,"d":"  398"},{"v":394,"d":"  394"},{"v":419,"d":"  419"},{"v":458,"d":"  458"},{"v":402,"d":"  402"},{"v":408,"d":"  408"},{"v":396,"d":"  396"},{"v":420,"d":"  420"},{"v":399,"d":"  399"},{"v":438,"d":"  438"},{"v":413,"d":"  413"},{"v":389,"d":"  389"},{"v":391,"d":"  391"}]
[null,403,{"$f":"VLOOKUP(Datenbereich_A17_2[[#This Row],[Spalte1]],AGS_Namen!$C$1:$D$58,2,FALSE)","v":"Oldenburg (Oldb), Stadt"},{"v":1311,"d":" 1 311"},{"v":1318,"d":" 1 318"},{"v":1264,"d":" 1 264"},{"v":1298,"d":" 1 298"},{"v":1322,"d":" 1 322"},{"v":1289,"d":" 1 289"},{"v":1299,"d":" 1 299"},{"v":1282,"d":" 1 282"},{"v":1349,"d":" 1 349"},{"v":1394,"d":" 1 394"},{"v":1372,"d":" 1 372"},{"v":1409,"d":" 1 409"},{"v":1423,"d":" 1 423"},{"v":1409,"d":" 1 409"},{"v":1373,"d":" 1 373"}]
[null,404,{"$f":"VLOOKUP(Datenbereich_A17_2[[#This Row],[Spalte1]],AGS_Namen!$C$1:$D$58,2,FALSE)","v":"Osnabrück, Stadt"},{"v":1319,"d":" 1 319"},{"v":1274,"d":" 1 274"},{"v":1389,"d":" 1 389"},{"v":1398,"d":" 1 398"},{"v":1314,"d":" 1 314"},{"v":1296,"d":" 1 296"},{"v":1342,"d":" 1 342"},{"v":1342,"d":" 1 342"},{"v":1356,"d":" 1 356"},{"v":1339,"d":" 1 339"},{"v":1347,"d":" 1 347"},{"v":1452,"d":" 1 452"},{"v":1433,"d":" 1 433"},{"v":1426,"d":" 1 426"},{"v":1372,"d":" 1 372"}]
[null,405,{"$f":"VLOOKUP(Datenbereich_A17_2[[#This Row],[Spalte1]],AGS_Namen!$C$1:$D$58,2,FALSE)","v":"Wilhelmshaven, Stadt"},{"v":563,"d":"  563"},{"v":583,"d":"  583"},{"v":570,"d":"  570"},{"v":574,"d":"  574"},{"v":535,"d":"  535"},{"v":594,"d":"  594"},{"v":534,"d":"  534"},{"v":551,"d":"  551"},{"v":527,"d":"  527"},{"v":527,"d":"  527"},{"v":510,"d":"  510"},{"v":580,"d":"  580"},{"v":574,"d":"  574"},{"v":527,"d":"  527"},{"v":536,"d":"  536"}]
[null,451,{"$f":"VLOOKUP(Datenbereich_A17_2[[#This Row],[Spalte1]],AGS_Namen!$C$1:$D$58,2,FALSE)","v":"Ammerland"},{"v":984,"d":"  984"},{"v":949,"d":"  949"},{"v":872,"d":"  872"},{"v":901,"d":"  901"},{"v":831,"d":"  831"},{"v":918,"d":"  918"},{"v":884,"d":"  884"},{"v":893,"d":"  893"},{"v":852,"d":"  852"},{"v":945,"d":"  945"},{"v":944,"d":"  944"},{"v":1029,"d":" 1 029"},{"v":960,"d":"  960"},{"v":992,"d":"  992"},{"v":1071,"d":" 1 071"}]
[null,452,{"$f":"VLOOKUP(Datenbereich_A17_2[[#This Row],[Spalte1]],AGS_Namen!$C$1:$D$58,2,FALSE)","v":"Aurich"},{"v":1616,"d":" 1 616"},{"v":1522,"d":" 1 522"},{"v":1579,"d":" 1 579"},{"v":1520,"d":" 1 520"},{"v":1440,"d":" 1 440"},{"v":1477,"d":" 1 477"},{"v":1422,"d":" 1 422"},{"v":1420,"d":" 1 420"},{"v":1414,"d":" 1 414"},{"v":1413,"d":" 1 413"},{"v":1433,"d":" 1 433"},{"v":1513,"d":" 1 513"},{"v":1552,"d":" 1 552"},{"v":1498,"d":" 1 498"},{"v":1524,"d":" 1 524"}]
[null,453,{"$f":"VLOOKUP(Datenbereich_A17_2[[#This Row],[Spalte1]],AGS_Namen!$C$1:$D$58,2,FALSE)","v":"Cloppenburg"},{"v":1683,"d":" 1 683"},{"v":1663,"d":" 1 663"},{"v":1603,"d":" 1 603"},{"v":1518,"d":" 1 518"},{"v":1549,"d":" 1 549"},{"v":1528,"d":" 1 528"},{"v":1524,"d":" 1 524"},{"v":1481,"d":" 1 481"},{"v":1473,"d":" 1 473"},{"v":1538,"d":" 1 538"},{"v":1563,"d":" 1 563"},{"v":1631,"d":" 1 631"},{"v":1664,"d":" 1 664"},{"v":1604,"d":" 1 604"},{"v":1683,"d":" 1 683"}]
[null,454,{"$f":"VLOOKUP(Datenbereich_A17_2[[#This Row],[Spalte1]],AGS_Namen!$C$1:$D$58,2,FALSE)","v":"Emsland"},{"v":2937,"d":" 2 937"},{"v":2769,"d":" 2 769"},{"v":2756,"d":" 2 756"},{"v":2707,"d":" 2 707"},{"v":2636,"d":" 2 636"},{"v":2562,"d":" 2 562"},{"v":2566,"d":" 2 566"},{"v":2542,"d":" 2 542"},{"v":2464,"d":" 2 464"},{"v":2679,"d":" 2 679"},{"v":2598,"d":" 2 598"},{"v":2882,"d":" 2 882"},{"v":2828,"d":" 2 828"},{"v":2791,"d":" 2 791"},{"v":2834,"d":" 2 834"}]
[null,455,{"$f":"VLOOKUP(Datenbereich_A17_2[[#This Row],[Spalte1]],AGS_Namen!$C$1:$D$58,2,FALSE)","v":"Friesland"},{"v":687,"d":"  687"},{"v":687,"d":"  687"},{"v":730,"d":"  730"},{"v":689,"d":"  689"},{"v":682,"d":"  682"},{"v":680,"d":"  680"},{"v":648,"d":"  648"},{"v":659,"d":"  659"},{"v":630,"d":"  630"},{"v":663,"d":"  663"},{"v":704,"d":"  704"},{"v":727,"d":"  727"},{"v":707,"d":"  707"},{"v":693,"d":"  693"},{"v":754,"d":"  754"}]
[null,456,{"$f":"VLOOKUP(Datenbereich_A17_2[[#This Row],[Spalte1]],AGS_Namen!$C$1:$D$58,2,FALSE)","v":"Grafschaft Bentheim"},{"v":1154,"d":" 1 154"},{"v":1136,"d":" 1 136"},{"v":1027,"d":" 1 027"},{"v":1121,"d":" 1 121"},{"v":1075,"d":" 1 075"},{"v":1096,"d":" 1 096"},{"v":1007,"d":" 1 007"},{"v":1009,"d":" 1 009"},{"v":1079,"d":" 1 079"},{"v":1118,"d":" 1 118"},{"v":1086,"d":" 1 086"},{"v":1044,"d":" 1 044"},{"v":1146,"d":" 1 146"},{"v":1149,"d":" 1 149"},{"v":1166,"d":" 1 166"}]
[null,457,{"$f":"VLOOKUP(Datenbereich_A17_2[[#This Row],[Spalte1]],AGS_Namen!$C$1:$D$58,2,FALSE)","v":"Leer"},{"v":1444,"d":" 1 444"},{"v":1350,"d":" 1 350"},{"v":1364,"d":" 1 364"},{"v":1314,"d":" 1 314"},{"v":1301,"d":" 1 301"},{"v":1316,"d":" 1 316"},{"v":1222,"d":" 1 222"},{"v":1323,"d":" 1 323"},{"v":1312,"d":" 1 312"},{"v":1295,"d":" 1 295"},{"v":1301,"d":" 1 301"},{"v":1453,"d":" 1 453"},{"v":1419,"d":" 1 419"},{"v":1464,"d":" 1 464"},{"v":1392,"d":" 1 392"}]
[null,458,{"$f":"VLOOKUP(Datenbereich_A17_2[[#This Row],[Spalte1]],AGS_Namen!$C$1:$D$58,2,FALSE)","v":"Oldenburg"},{"v":1060,"d":" 1 060"},{"v":987,"d":"  987"},{"v":931,"d":"  931"},{"v":967,"d":"  967"},{"v":983,"d":"  983"},{"v":920,"d":"  920"},{"v":885,"d":"  885"},{"v":909,"d":"  909"},{"v":885,"d":"  885"},{"v":886,"d":"  886"},{"v":890,"d":"  890"},{"v":1058,"d":" 1 058"},{"v":1040,"d":" 1 040"},{"v":1024,"d":" 1 024"},{"v":1034,"d":" 1 034"}]
[null,459,{"$f":"VLOOKUP(Datenbereich_A17_2[[#This Row],[Spalte1]],AGS_Namen!$C$1:$D$58,2,FALSE)","v":"Osnabrück"},{"v":3274,"d":" 3 274"},{"v":3073,"d":" 3 073"},{"v":2931,"d":" 2 931"},{"v":3118,"d":" 3 118"},{"v":2811,"d":" 2 811"},{"v":2892,"d":" 2 892"},{"v":2879,"d":" 2 879"},{"v":2848,"d":" 2 848"},{"v":2793,"d":" 2 793"},{"v":2934,"d":" 2 934"},{"v":2906,"d":" 2 906"},{"v":3038,"d":" 3 038"},{"v":3094,"d":" 3 094"},{"v":3050,"d":" 3 050"},{"v":3197,"d":" 3 197"}]
[null,460,{"$f":"VLOOKUP(Datenbereich_A17_2[[#This Row],[Spalte1]],AGS_Namen!$C$1:$D$58,2,FALSE)","v":"Vechta"},{"v":1344,"d":" 1 344"},{"v":1185,"d":" 1 185"},{"v":1281,"d":" 1 281"},{"v":1266,"d":" 1 266"},{"v":1255,"d":" 1 255"},{"v":1237,"d":" 1 237"},{"v":1208,"d":" 1 208"},{"v":1290,"d":" 1 290"},{"v":1232,"d":" 1 232"},{"v":1251,"d":" 1 251"},{"v":1151,"d":" 1 151"},{"v":1313,"d":" 1 313"},{"v":1308,"d":" 1 308"},{"v":1317,"d":" 1 317"},{"v":1403,"d":" 1 403"}]
[null,461,{"$f":"VLOOKUP(Datenbereich_A17_2[[#This Row],[Spalte1]],AGS_Namen!$C$1:$D$58,2,FALSE)","v":"Wesermarsch"},{"v":740,"d":"  740"},{"v":685,"d":"  685"},{"v":685,"d":"  685"},{"v":673,"d":"  673"},{"v":628,"d":"  628"},{"v":600,"d":"  600"},{"v":588,"d":"  588"},{"v":596,"d":"  596"},{"v":594,"d":"  594"},{"v":612,"d":"  612"},{"v":572,"d":"  572"},{"v":704,"d":"  704"},{"v":681,"d":"  681"},{"v":649,"d":"  649"},{"v":669,"d":"  669"}]
[null,462,{"$f":"VLOOKUP(Datenbereich_A17_2[[#This Row],[Spalte1]],AGS_Namen!$C$1:$D$58,2,FALSE)","v":"Wittmund"},{"v":474,"d":"  474"},{"v":467,"d":"  467"},{"v":442,"d":"  442"},{"v":435,"d":"  435"},{"v":427,"d":"  427"},{"v":413,"d":"  413"},{"v":400,"d":"  400"},{"v":425,"d":"  425"},{"v":387,"d":"  387"},{"v":414,"d":"  414"},{"v":437,"d":"  437"},{"v":396,"d":"  396"},{"v":420,"d":"  420"},{"v":397,"d":"  397"},{"v":407,"d":"  407"}]
[null,4,{"$f":"VLOOKUP(Datenbereich_A17_2[[#This Row],[Spalte1]],AGS_Namen!$C$1:$D$58,2,FALSE)","v":"Stat. Region Weser-Ems"},{"v":21584,"d":" 21 584"},{"v":20701,"d":" 20 701"},{"v":20396,"d":" 20 396"},{"v":20476,"d":" 20 476"},{"v":19728,"d":" 19 728"},{"v":19841,"d":" 19 841"},{"v":19394,"d":" 19 394"},{"v":19537,"d":" 19 537"},{"v":19293,"d":" 19 293"},{"v":20071,"d":" 20 071"},{"v":19845,"d":" 19 845"},{"v":21340,"d":" 21 340"},{"v":21318,"d":" 21 318"},{"v":21020,"d":" 21 020"},{"v":21469,"d":" 21 469"}]
[null,0,{"$f":"VLOOKUP(Datenbereich_A17_2[[#This Row],[Spalte1]],AGS_Namen!$C$1:$D$58,2,FALSE)","v":"Niedersachsen"},{"v":64689,"d":" 64 689"},{"v":63053,"d":" 63 053"},{"v":62941,"d":" 62 941"},{"v":62569,"d":" 62 569"},{"v":60223,"d":" 60 223"},{"v":61091,"d":" 61 091"},{"v":59314,"d":" 59 314"},{"v":59039,"d":" 59 039"},{"v":59863,"d":" 59 863"},{"v":62158,"d":" 62 158"},{"v":61861,"d":" 61 861"},{"v":66122,"d":" 66 122"},{"v":64616,"d":" 64 616"},{"v":64813,"d":" 64 813"},{"v":64739,"d":" 64 739"}]
[]
[null,null,"Quelle: Statistik der natürlichen Bevölkerungsbewegung"]
[]
[null,null,"Karte A17-2: Anteil der lebendgeborenen ausländischen Kinder an allen Lebendgeborenen 2019 in Prozent"]
{"$rows_empty":38}
[null,null,{"$f":"Def","v":"Die Definition zu dem Indikator sowie methodische Hinweise finden Sie in der Tabelle Aktuelle Ergebnisse"}]
[null,null,"Link zur LSN-Online-Datenbank"]
[null,null,"Link zum Regionalmonitoring Niedersachsen"]

{"sheet":"A22","index":16,"n_rows":98,"n_cols":18,"rows_kept":98,"merged":[[2,2,2,4],[7,2,10,2],[7,3,7,7],[7,8,7,12],[7,13,7,17],[8,3,9,3],[8,4,8,7],[8,8,9,8],[8,9,8,12],[8,13,9,13],[8,14,8,17],[10,3,10,17],[70,2,70,13],[96,2,96,13]]}
[null,null,{"$f":"Kopf","v":"Migration und Teilhabe in Niedersachsen - Integrationsmonitoring 2020 - Regionalinformationen "}]
[]
[]
[]
[null,null,"Indikator A22: Saldo der Zu- und Fortzüge über die Bundesgrenzen von und nach Niedersachsen"]
[null,null,"Tabelle A22-2: Saldo der Zu- und Fortzüge über die Bundesgrenzen 2019 nach Kreisen"]
[]
[null,null,"Kreisfreie Stadt\nLandkreis\n(Großstadt, Umland)\nStatistische Region\nLand","Zuzüge",{"$nulls":4},"Fortzüge",{"$nulls":4},"Saldo der Zu- und Fortzüge"]
[{"$nulls":3},"Insgesamt","und zwar",{"$nulls":3},"Insgesamt","und zwar",{"$nulls":3},"Insgesamt","und zwar"]
[{"$nulls":4},"Deutsche","Ausländerinnen und Ausländer","Männer","Frauen",null,"Deutsche","Ausländerinnen und Ausländer","Männer","Frauen",null,"Deutsche","Ausländerinnen und Ausländer","Männer","Frauen"]
[{"$nulls":3},"Anzahl"]
[null,"AGS","1","2","3","4","5","6","7","8","9","10","11","12","13","14","15","16"]
[null,{"v":101,"d":"+ 101"},{"$f":"VLOOKUP(Datenbereich_A22[[#This Row],[AGS]],AGS_Namen!$C$1:$D$58,2,FALSE)","v":"Braunschweig, Stadt"},{"v":3914,"d":" 3 914"},{"v":613,"d":"  613"},{"v":3301,"d":" 3 301"},{"v":2378,"d":" 2 378"},{"v":1536,"d":" 1 536"},{"v":3009,"d":" 3 009"},{"v":764,"d":"  764"},{"v":2245,"d":" 2 245"},{"v":1974,"d":" 1 974"},{"v":1035,"d":" 1 035"},{"v":905,"d":"+ 905"},{"v":-151,"d":"- 151"},{"v":1056,"d":"+1 056"},{"v":404,"d":"+ 404"},{"v":501,"d":"+ 501"}]
[null,{"v":102,"d":"+ 102"},{"$f":"VLOOKUP(Datenbereich_A22[[#This Row],[AGS]],AGS_Namen!$C$1:$D$58,2,FALSE)","v":"Salzgitter, Stadt"},{"v":2470,"d":" 2 470"},{"v":290,"d":"  290"},{"v":2180,"d":" 2 180"},{"v":1561,"d":" 1 561"},{"v":909,"d":"  909"},{"v":2629,"d":" 2 629"},{"v":467,"d":"  467"},{"v":2162,"d":" 2 162"},{"v":1791,"d":" 1 791"},{"v":838,"d":"  838"},{"v":-159,"d":"- 159"},{"v":-177,"d":"- 177"},{"v":18,"d":"+ 18"},{"v":-230,"d":"- 230"},{"v":71,"d":"+ 71"}]
[null,{"v":103,"d":"+ 103"},{"$f":"VLOOKUP(Datenbereich_A22[[#This Row],[AGS]],AGS_Namen!$C$1:$D$58,2,FALSE)","v":"Wolfsburg, Stadt"},{"v":2342,"d":" 2 342"},{"v":241,"d":"  241"},{"v":2101,"d":" 2 101"},{"v":1426,"d":" 1 426"},{"v":916,"d":"  916"},{"v":1550,"d":" 1 550"},{"v":247,"d":"  247"},{"v":1303,"d":" 1 303"},{"v":1028,"d":" 1 028"},{"v":522,"d":"  522"},{"v":792,"d":"+ 792"},{"v":-6,"d":"- 6"},{"v":798,"d":"+ 798"},{"v":398,"d":"+ 398"},{"v":394,"d":"+ 394"}]
[null,{"v":151,"d":"+ 151"},{"$f":"VLOOKUP(Datenbereich_A22[[#This Row],[AGS]],AGS_Namen!$C$1:$D$58,2,FALSE)","v":"Gifhorn"},{"v":1589,"d":" 1 589"},{"v":299,"d":"  299"},{"v":1290,"d":" 1 290"},{"v":1021,"d":" 1 021"},{"v":568,"d":"  568"},{"v":1277,"d":" 1 277"},{"v":397,"d":"  397"},{"v":880,"d":"  880"},{"v":938,"d":"  938"},{"v":339,"d":"  339"},{"v":312,"d":"+ 312"},{"v":-98,"d":"- 98"},{"v":410,"d":"+ 410"},{"v":83,"d":"+ 83"},{"v":229,"d":"+ 229"}]
[null,{"v":153,"d":"+ 153"},{"$f":"VLOOKUP(Datenbereich_A22[[#This Row],[AGS]],AGS_Namen!$C$1:$D$58,2,FALSE)","v":"Goslar"},{"v":3065,"d":" 3 065"},{"v":288,"d":"  288"},{"v":2777,"d":" 2 777"},{"v":2009,"d":" 2 009"},{"v":1056,"d":" 1 056"},{"v":1710,"d":" 1 710"},{"v":359,"d":"  359"},{"v":1351,"d":" 1 351"},{"v":1116,"d":" 1 116"},{"v":594,"d":"  594"},{"v":1355,"d":"+1 355"},{"v":-71,"d":"- 71"},{"v":1426,"d":"+1 426"},{"v":893,"d":"+ 893"},{"v":462,"d":"+ 462"}]
[null,{"v":154,"d":"+ 154"},{"$f":"VLOOKUP(Datenbereich_A22[[#This Row],[AGS]],AGS_Namen!$C$1:$D$58,2,FALSE)","v":"Helmstedt"},{"v":965,"d":"  965"},{"v":213,"d":"  213"},{"v":752,"d":"  752"},{"v":636,"d":"  636"},{"v":329,"d":"  329"},{"v":798,"d":"  798"},{"v":266,"d":"  266"},{"v":532,"d":"  532"},{"v":555,"d":"  555"},{"v":243,"d":"  243"},{"v":167,"d":"+ 167"},{"v":-53,"d":"- 53"},{"v":220,"d":"+ 220"},{"v":81,"d":"+ 81"},{"v":86,"d":"+ 86"}]
[null,{"v":155,"d":"+ 155"},{"$f":"VLOOKUP(Datenbereich_A22[[#This Row],[AGS]],AGS_Namen!$C$1:$D$58,2,FALSE)","v":"Northeim"},{"v":1021,"d":" 1 021"},{"v":233,"d":"  233"},{"v":788,"d":"  788"},{"v":649,"d":"  649"},{"v":372,"d":"  372"},{"v":867,"d":"  867"},{"v":270,"d":"  270"},{"v":597,"d":"  597"},{"v":571,"d":"  571"},{"v":296,"d":"  296"},{"v":154,"d":"+ 154"},{"v":-37,"d":"- 37"},{"v":191,"d":"+ 191"},{"v":78,"d":"+ 78"},{"v":76,"d":"+ 76"}]
[null,{"v":157,"d":"+ 157"},{"$f":"VLOOKUP(Datenbereich_A22[[#This Row],[AGS]],AGS_Namen!$C$1:$D$58,2,FALSE)","v":"Peine"},{"v":1603,"d":" 1 603"},{"v":272,"d":"  272"},{"v":1331,"d":" 1 331"},{"v":996,"d":"  996"},{"v":607,"d":"  607"},{"v":1332,"d":" 1 332"},{"v":310,"d":"  310"},{"v":1022,"d":" 1 022"},{"v":874,"d":"  874"},{"v":458,"d":"  458"},{"v":271,"d":"+ 271"},{"v":-38,"d":"- 38"},{"v":309,"d":"+ 309"},{"v":122,"d":"+ 122"},{"v":149,"d":"+ 149"}]
[null,{"v":158,"d":"+ 158"},{"$f":"VLOOKUP(Datenbereich_A22[[#This Row],[AGS]],AGS_Namen!$C$1:$D$58,2,FALSE)","v":"Wolfenbüttel"},{"v":841,"d":"  841"},{"v":229,"d":"  229"},{"v":612,"d":"  612"},{"v":495,"d":"  495"},{"v":346,"d":"  346"},{"v":705,"d":"  705"},{"v":270,"d":"  270"},{"v":435,"d":"  435"},{"v":465,"d":"  465"},{"v":240,"d":"  240"},{"v":136,"d":"+ 136"},{"v":-41,"d":"- 41"},{"v":177,"d":"+ 177"},{"v":30,"d":"+ 30"},{"v":106,"d":"+ 106"}]
[null,{"v":159,"d":"+ 159"},{"$f":"VLOOKUP(Datenbereich_A22[[#This Row],[AGS]],AGS_Namen!$C$1:$D$58,2,FALSE)","v":"Göttingen"},{"v":16693,"d":" 16 693"},{"v":6667,"d":" 6 667"},{"v":10026,"d":" 10 026"},{"v":8243,"d":" 8 243"},{"v":8450,"d":" 8 450"},{"v":4209,"d":" 4 209"},{"v":1255,"d":" 1 255"},{"v":2954,"d":" 2 954"},{"v":2365,"d":" 2 365"},{"v":1844,"d":" 1 844"},{"v":12484,"d":"+12 484"},{"v":5412,"d":"+5 412"},{"v":7072,"d":"+7 072"},{"v":5878,"d":"+5 878"},{"v":6606,"d":"+6 606"}]
[null,{"v":159016,"d":"+159 016"},{"$f":"VLOOKUP(Datenbereich_A22[[#This Row],[AGS]],AGS_Namen!$C$1:$D$58,2,FALSE)","v":"   dav. Göttingen, Stadt"},{"v":3172,"d":" 3 172"},{"v":401,"d":"  401"},{"v":2771,"d":" 2 771"},{"v":1609,"d":" 1 609"},{"v":1563,"d":" 1 563"},{"v":2770,"d":" 2 770"},{"v":687,"d":"  687"},{"v":2083,"d":" 2 083"},{"v":1449,"d":" 1 449"},{"v":1321,"d":" 1 321"},{"v":402,"d":"+ 402"},{"v":-286,"d":"- 286"},{"v":688,"d":"+ 688"},{"v":160,"d":"+ 160"},{"v":242,"d":"+ 242"}]
[null,{"v":159999,"d":"+159 999"},{"$f":"VLOOKUP(Datenbereich_A22[[#This Row],[AGS]],AGS_Namen!$C$1:$D$58,2,FALSE)","v":"   dav. Göttingen, Umland"},{"v":13521,"d":" 13 521"},{"v":6266,"d":" 6 266"},{"v":7255,"d":" 7 255"},{"v":6634,"d":" 6 634"},{"v":6887,"d":" 6 887"},{"v":1439,"d":" 1 439"},{"v":568,"d":"  568"},{"v":871,"d":"  871"},{"v":916,"d":"  916"},{"v":523,"d":"  523"},{"v":12082,"d":"+12 082"},{"v":5698,"d":"+5 698"},{"v":6384,"d":"+6 384"},{"v":5718,"d":"+5 718"},{"v":6364,"d":"+6 364"}]
[null,{"v":1,"d":"+ 1"},{"$f":"VLOOKUP(Datenbereich_A22[[#This Row],[AGS]],AGS_Namen!$C$1:$D$58,2,FALSE)","v":"Stat. Region Braunschweig"},{"v":34503,"d":" 34 503"},{"v":9345,"d":" 9 345"},{"v":25158,"d":" 25 158"},{"v":19414,"d":" 19 414"},{"v":15089,"d":" 15 089"},{"v":18086,"d":" 18 086"},{"v":4605,"d":" 4 605"},{"v":13481,"d":" 13 481"},{"v":11677,"d":" 11 677"},{"v":6409,"d":" 6 409"},{"v":16417,"d":"+16 417"},{"v":4740,"d":"+4 740"},{"v":11677,"d":"+11 677"},{"v":7737,"d":"+7 737"},{"v":8680,"d":"+8 680"}]
[null,{"v":241,"d":"+ 241"},{"$f":"VLOOKUP(Datenbereich_A22[[#This Row],[AGS]],AGS_Namen!$C$1:$D$58,2,FALSE)","v":"Hannover, Region"},{"v":18400,"d":" 18 400"},{"v":3365,"d":" 3 365"},{"v":15035,"d":" 15 035"},{"v":11438,"d":" 11 438"},{"v":6962,"d":" 6 962"},{"v":15212,"d":" 15 212"},{"v":4444,"d":" 4 444"},{"v":10768,"d":" 10 768"},{"v":10161,"d":" 10 161"},{"v":5051,"d":" 5 051"},{"v":3188,"d":"+3 188"},{"v":-1079,"d":"-1 079"},{"v":4267,"d":"+4 267"},{"v":1277,"d":"+1 277"},{"v":1911,"d":"+1 911"}]
[null,{"v":241001,"d":"+241 001"},{"$f":"VLOOKUP(Datenbereich_A22[[#This Row],[AGS]],AGS_Namen!$C$1:$D$58,2,FALSE)","v":"   dav. Hannover, Lhst."},{"v":10855,"d":" 10 855"},{"v":1905,"d":" 1 905"},{"v":8950,"d":" 8 950"},{"v":6542,"d":" 6 542"},{"v":4313,"d":" 4 313"},{"v":8801,"d":" 8 801"},{"v":2626,"d":" 2 626"},{"v":6175,"d":" 6 175"},{"v":5716,"d":" 5 716"},{"v":3085,"d":" 3 085"},{"v":2054,"d":"+2 054"},{"v":-721,"d":"- 721"},{"v":2775,"d":"+2 775"},{"v":826,"d":"+ 826"},{"v":1228,"d":"+1 228"}]
[null,{"v":241999,"d":"+241 999"},{"$f":"VLOOKUP(Datenbereich_A22[[#This Row],[AGS]],AGS_Namen!$C$1:$D$58,2,FALSE)","v":"   dav. Hannover, Umland"},{"v":7545,"d":" 7 545"},{"v":1460,"d":" 1 460"},{"v":6085,"d":" 6 085"},{"v":4896,"d":" 4 896"},{"v":2649,"d":" 2 649"},{"v":6411,"d":" 6 411"},{"v":1818,"d":" 1 818"},{"v":4593,"d":" 4 593"},{"v":4445,"d":" 4 445"},{"v":1966,"d":" 1 966"},{"v":1134,"d":"+1 134"},{"v":-358,"d":"- 358"},{"v":1492,"d":"+1 492"},{"v":451,"d":"+ 451"},{"v":683,"d":"+ 683"}]
[null,{"v":251,"d":"+ 251"},{"$f":"VLOOKUP(Datenbereich_A22[[#This Row],[AGS]],AGS_Namen!$C$1:$D$58,2,FALSE)","v":"Diepholz"},{"v":3473,"d":" 3 473"},{"v":519,"d":"  519"},{"v":2954,"d":" 2 954"},{"v":2147,"d":" 2 147"},{"v":1326,"d":" 1 326"},{"v":3118,"d":" 3 118"},{"v":686,"d":"  686"},{"v":2432,"d":" 2 432"},{"v":2013,"d":" 2 013"},{"v":1105,"d":" 1 105"},{"v":355,"d":"+ 355"},{"v":-167,"d":"- 167"},{"v":522,"d":"+ 522"},{"v":134,"d":"+ 134"},{"v":221,"d":"+ 221"}]
[null,{"v":252,"d":"+ 252"},{"$f":"VLOOKUP(Datenbereich_A22[[#This Row],[AGS]],AGS_Namen!$C$1:$D$58,2,FALSE)","v":"Hameln-Pyrmont"},{"v":1923,"d":" 1 923"},{"v":425,"d":"  425"},{"v":1498,"d":" 1 498"},{"v":1270,"d":" 1 270"},{"v":653,"d":"  653"},{"v":1648,"d":" 1 648"},{"v":445,"d":"  445"},{"v":1203,"d":" 1 203"},{"v":1145,"d":" 1 145"},{"v":503,"d":"  503"},{"v":275,"d":"+ 275"},{"v":-20,"d":"- 20"},{"v":295,"d":"+ 295"},{"v":125,"d":"+ 125"},{"v":150,"d":"+ 150"}]
[null,{"v":254,"d":"+ 254"},{"$f":"VLOOKUP(Datenbereich_A22[[#This Row],[AGS]],AGS_Namen!$C$1:$D$58,2,FALSE)","v":"Hildesheim"},{"v":3060,"d":" 3 060"},{"v":528,"d":"  528"},{"v":2532,"d":" 2 532"},{"v":1884,"d":" 1 884"},{"v":1176,"d":" 1 176"},{"v":2555,"d":" 2 555"},{"v":643,"d":"  643"},{"v":1912,"d":" 1 912"},{"v":1683,"d":" 1 683"},{"v":872,"d":"  872"},{"v":505,"d":"+ 505"},{"v":-115,"d":"- 115"},{"v":620,"d":"+ 620"},{"v":201,"d":"+ 201"},{"v":304,"d":"+ 304"}]
[null,{"v":255,"d":"+ 255"},{"$f":"VLOOKUP(Datenbereich_A22[[#This Row],[AGS]],AGS_Namen!$C$1:$D$58,2,FALSE)","v":"Holzminden"},{"v":812,"d":"  812"},{"v":173,"d":"  173"},{"v":639,"d":"  639"},{"v":523,"d":"  523"},{"v":289,"d":"  289"},{"v":664,"d":"  664"},{"v":198,"d":"  198"},{"v":466,"d":"  466"},{"v":465,"d":"  465"},{"v":199,"d":"  199"},{"v":148,"d":"+ 148"},{"v":-25,"d":"- 25"},{"v":173,"d":"+ 173"},{"v":58,"d":"+ 58"},{"v":90,"d":"+ 90"}]
[null,{"v":256,"d":"+ 256"},{"$f":"VLOOKUP(Datenbereich_A22[[#This Row],[AGS]],AGS_Namen!$C$1:$D$58,2,FALSE)","v":"Nienburg (Weser)"},{"v":2845,"d":" 2 845"},{"v":279,"d":"  279"},{"v":2566,"d":" 2 566"},{"v":1807,"d":" 1 807"},{"v":1038,"d":" 1 038"},{"v":2845,"d":" 2 845"},{"v":363,"d":"  363"},{"v":2482,"d":" 2 482"},{"v":1892,"d":" 1 892"},{"v":953,"d":"  953"},{"v":0,"d":" 0"},{"v":-84,"d":"- 84"},{"v":84,"d":"+ 84"},{"v":-85,"d":"- 85"},{"v":85,"d":"+ 85"}]
[null,{"v":257,"d":"+ 257"},{"$f":"VLOOKUP(Datenbereich_A22[[#This Row],[AGS]],AGS_Namen!$C$1:$D$58,2,FALSE)","v":"Schaumburg"},{"v":1828,"d":" 1 828"},{"v":355,"d":"  355"},{"v":1473,"d":" 1 473"},{"v":1213,"d":" 1 213"},{"v":615,"d":"  615"},{"v":1452,"d":" 1 452"},{"v":422,"d":"  422"},{"v":1030,"d":" 1 030"},{"v":997,"d":"  997"},{"v":455,"d":"  455"},{"v":376,"d":"+ 376"},{"v":-67,"d":"- 67"},{"v":443,"d":"+ 443"},{"v":216,"d":"+ 216"},{"v":160,"d":"+ 160"}]
[null,{"v":2,"d":"+ 2"},{"$f":"VLOOKUP(Datenbereich_A22[[#This Row],[AGS]],AGS_Namen!$C$1:$D$58,2,FALSE)","v":"Stat. Region Hannover"},{"v":32341,"d":" 32 341"},{"v":5644,"d":" 5 644"},{"v":26697,"d":" 26 697"},{"v":20282,"d":" 20 282"},{"v":12059,"d":" 12 059"},{"v":27494,"d":" 27 494"},{"v":7201,"d":" 7 201"},{"v":20293,"d":" 20 293"},{"v":18356,"d":" 18 356"},{"v":9138,"d":" 9 138"},{"v":4847,"d":"+4 847"},{"v":-1557,"d":"-1 557"},{"v":6404,"d":"+6 404"},{"v":1926,"d":"+1 926"},{"v":2921,"d":"+2 921"}]
[null,{"v":351,"d":"+ 351"},{"$f":"VLOOKUP(Datenbereich_A22[[#This Row],[AGS]],AGS_Namen!$C$1:$D$58,2,FALSE)","v":"Celle"},{"v":2366,"d":" 2 366"},{"v":553,"d":"  553"},{"v":1813,"d":" 1 813"},{"v":1486,"d":" 1 486"},{"v":880,"d":"  880"},{"v":2142,"d":" 2 142"},{"v":587,"d":"  587"},{"v":1555,"d":" 1 555"},{"v":1393,"d":" 1 393"},{"v":749,"d":"  749"},{"v":224,"d":"+ 224"},{"v":-34,"d":"- 34"},{"v":258,"d":"+ 258"},{"v":93,"d":"+ 93"},{"v":131,"d":"+ 131"}]
[null,{"v":352,"d":"+ 352"},{"$f":"VLOOKUP(Datenbereich_A22[[#This Row],[AGS]],AGS_Namen!$C$1:$D$58,2,FALSE)","v":"Cuxhaven"},{"v":1871,"d":" 1 871"},{"v":444,"d":"  444"},{"v":1427,"d":" 1 427"},{"v":1220,"d":" 1 220"},{"v":651,"d":"  651"},{"v":1708,"d":" 1 708"},{"v":600,"d":"  600"},{"v":1108,"d":" 1 108"},{"v":1173,"d":" 1 173"},{"v":535,"d":"  535"},{"v":163,"d":"+ 163"},{"v":-156,"d":"- 156"},{"v":319,"d":"+ 319"},{"v":47,"d":"+ 47"},{"v":116,"d":"+ 116"}]
[null,{"v":353,"d":"+ 353"},{"$f":"VLOOKUP(Datenbereich_A22[[#This Row],[AGS]],AGS_Namen!$C$1:$D$58,2,FALSE)","v":"Harburg"},{"v":3909,"d":" 3 909"},{"v":607,"d":"  607"},{"v":3302,"d":" 3 302"},{"v":2588,"d":" 2 588"},{"v":1321,"d":" 1 321"},{"v":3310,"d":" 3 310"},{"v":699,"d":"  699"},{"v":2611,"d":" 2 611"},{"v":2431,"d":" 2 431"},{"v":879,"d":"  879"},{"v":599,"d":"+ 599"},{"v":-92,"d":"- 92"},{"v":691,"d":"+ 691"},{"v":157,"d":"+ 157"},{"v":442,"d":"+ 442"}]
[null,{"v":354,"d":"+ 354"},{"$f":"VLOOKUP(Datenbereich_A22[[#This Row],[AGS]],AGS_Namen!$C$1:$D$58,2,FALSE)","v":"Lüchow-Dannenberg"},{"v":521,"d":"  521"},{"v":149,"d":"  149"},{"v":372,"d":"  372"},{"v":323,"d":"  323"},{"v":198,"d":"  198"},{"v":456,"d":"  456"},{"v":188,"d":"  188"},{"v":268,"d":"  268"},{"v":286,"d":"  286"},{"v":170,"d":"  170"},{"v":65,"d":"+ 65"},{"v":-39,"d":"- 39"},{"v":104,"d":"+ 104"},{"v":37,"d":"+ 37"},{"v":28,"d":"+ 28"}]
[null,{"v":355,"d":"+ 355"},{"$f":"VLOOKUP(Datenbereich_A22[[#This Row],[AGS]],AGS_Namen!$C$1:$D$58,2,FALSE)","v":"Lüneburg"},{"v":2212,"d":" 2 212"},{"v":598,"d":"  598"},{"v":1614,"d":" 1 614"},{"v":1373,"d":" 1 373"},{"v":839,"d":"  839"},{"v":2130,"d":" 2 130"},{"v":786,"d":"  786"},{"v":1344,"d":" 1 344"},{"v":1399,"d":" 1 399"},{"v":731,"d":"  731"},{"v":82,"d":"+ 82"},{"v":-188,"d":"- 188"},{"v":270,"d":"+ 270"},{"v":-26,"d":"- 26"},{"v":108,"d":"+ 108"}]
[null,{"v":356,"d":"+ 356"},{"$f":"VLOOKUP(Datenbereich_A22[[#This Row],[AGS]],AGS_Namen!$C$1:$D$58,2,FALSE)","v":"Osterholz"},{"v":696,"d":"  696"},{"v":216,"d":"  216"},{"v":480,"d":"  480"},{"v":415,"d":"  415"},{"v":281,"d":"  281"},{"v":562,"d":"  562"},{"v":233,"d":"  233"},{"v":329,"d":"  329"},{"v":341,"d":"  341"},{"v":221,"d":"  221"},{"v":134,"d":"+ 134"},{"v":-17,"d":"- 17"},{"v":151,"d":"+ 151"},{"v":74,"d":"+ 74"},{"v":60,"d":"+ 60"}]
[null,{"v":357,"d":"+ 357"},{"$f":"VLOOKUP(Datenbereich_A22[[#This Row],[AGS]],AGS_Namen!$C$1:$D$58,2,FALSE)","v":"Rotenburg (Wümme)"},{"v":1889,"d":" 1 889"},{"v":300,"d":"  300"},{"v":1589,"d":" 1 589"},{"v":1181,"d":" 1 181"},{"v":708,"d":"  708"},{"v":1484,"d":" 1 484"},{"v":398,"d":"  398"},{"v":1086,"d":" 1 086"},{"v":972,"d":"  972"},{"v":512,"d":"  512"},{"v":405,"d":"+ 405"},{"v":-98,"d":"- 98"},{"v":503,"d":"+ 503"},{"v":209,"d":"+ 209"},{"v":196,"d":"+ 196"}]
[null,{"v":358,"d":"+ 358"},{"$f":"VLOOKUP(Datenbereich_A22[[#This Row],[AGS]],AGS_Namen!$C$1:$D$58,2,FALSE)","v":"Heidekreis"},{"v":6278,"d":" 6 278"},{"v":317,"d":"  317"},{"v":5961,"d":" 5 961"},{"v":3766,"d":" 3 766"},{"v":2512,"d":" 2 512"},{"v":1823,"d":" 1 823"},{"v":352,"d":"  352"},{"v":1471,"d":" 1 471"},{"v":1200,"d":" 1 200"},{"v":623,"d":"  623"},{"v":4455,"d":"+4 455"},{"v":-35,"d":"- 35"},{"v":4490,"d":"+4 490"},{"v":2566,"d":"+2 566"},{"v":1889,"d":"+1 889"}]
[null,{"v":359,"d":"+ 359"},{"$f":"VLOOKUP(Datenbereich_A22[[#This Row],[AGS]],AGS_Namen!$C$1:$D$58,2,FALSE)","v":"Stade"},{"v":3345,"d":" 3 345"},{"v":514,"d":"  514"},{"v":2831,"d":" 2 831"},{"v":2142,"d":" 2 142"},{"v":1203,"d":" 1 203"},{"v":2757,"d":" 2 757"},{"v":587,"d":"  587"},{"v":2170,"d":" 2 170"},{"v":1906,"d":" 1 906"},{"v":851,"d":"  851"},{"v":588,"d":"+ 588"},{"v":-73,"d":"- 73"},{"v":661,"d":"+ 661"},{"v":236,"d":"+ 236"},{"v":352,"d":"+ 352"}]
[null,{"v":360,"d":"+ 360"},{"$f":"VLOOKUP(Datenbereich_A22[[#This Row],[AGS]],AGS_Namen!$C$1:$D$58,2,FALSE)","v":"Uelzen"},{"v":1020,"d":" 1 020"},{"v":261,"d":"  261"},{"v":759,"d":"  759"},{"v":636,"d":"  636"},{"v":384,"d":"  384"},{"v":881,"d":"  881"},{"v":275,"d":"  275"},{"v":606,"d":"  606"},{"v":610,"d":"  610"},{"v":271,"d":"  271"},{"v":139,"d":"+ 139"},{"v":-14,"d":"- 14"},{"v":153,"d":"+ 153"},{"v":26,"d":"+ 26"},{"v":113,"d":"+ 113"}]
[null,{"v":361,"d":"+ 361"},{"$f":"VLOOKUP(Datenbereich_A22[[#This Row],[AGS]],AGS_Namen!$C$1:$D$58,2,FALSE)","v":"Verden"},{"v":1482,"d":" 1 482"},{"v":300,"d":"  300"},{"v":1182,"d":" 1 182"},{"v":908,"d":"  908"},{"v":574,"d":"  574"},{"v":1262,"d":" 1 262"},{"v":380,"d":"  380"},{"v":882,"d":"  882"},{"v":841,"d":"  841"},{"v":421,"d":"  421"},{"v":220,"d":"+ 220"},{"v":-80,"d":"- 80"},{"v":300,"d":"+ 300"},{"v":67,"d":"+ 67"},{"v":153,"d":"+ 153"}]
[null,{"v":3,"d":"+ 3"},{"$f":"VLOOKUP(Datenbereich_A22[[#This Row],[AGS]],AGS_Namen!$C$1:$D$58,2,FALSE)","v":"Stat. Region Lüneburg"},{"v":25589,"d":" 25 589"},{"v":4259,"d":" 4 259"},{"v":21330,"d":" 21 330"},{"v":16038,"d":" 16 038"},{"v":9551,"d":" 9 551"},{"v":18515,"d":" 18 515"},{"v":5085,"d":" 5 085"},{"v":13430,"d":" 13 430"},{"v":12552,"d":" 12 552"},{"v":5963,"d":" 5 963"},{"v":7074,"d":"+7 074"},{"v":-826,"d":"- 826"},{"v":7900,"d":"+7 900"},{"v":3486,"d":"+3 486"},{"v":3588,"d":"+3 588"}]
[null,{"v":401,"d":"+ 401"},{"$f":"VLOOKUP(Datenbereich_A22[[#This Row],[AGS]],AGS_Namen!$C$1:$D$58,2,FALSE)","v":"Delmenhorst, Stadt"},{"v":1633,"d":" 1 633"},{"v":285,"d":"  285"},{"v":1348,"d":" 1 348"},{"v":980,"d":"  980"},{"v":653,"d":"  653"},{"v":1350,"d":" 1 350"},{"v":337,"d":"  337"},{"v":1013,"d":" 1 013"},{"v":924,"d":"  924"},{"v":426,"d":"  426"},{"v":283,"d":"+ 283"},{"v":-52,"d":"- 52"},{"v":335,"d":"+ 335"},{"v":56,"d":"+ 56"},{"v":227,"d":"+ 227"}]
[null,{"v":402,"d":"+ 402"},{"$f":"VLOOKUP(Datenbereich_A22[[#This Row],[AGS]],AGS_Namen!$C$1:$D$58,2,FALSE)","v":"Emden, Stadt"},{"v":742,"d":"  742"},{"v":137,"d":"  137"},{"v":605,"d":"  605"},{"v":504,"d":"  504"},{"v":238,"d":"  238"},{"v":599,"d":"  599"},{"v":202,"d":"  202"},{"v":397,"d":"  397"},{"v":424,"d":"  424"},{"v":175,"d":"  175"},{"v":143,"d":"+ 143"},{"v":-65,"d":"- 65"},{"v":208,"d":"+ 208"},{"v":80,"d":"+ 80"},{"v":63,"d":"+ 63"}]
[null,{"v":403,"d":"+ 403"},{"$f":"VLOOKUP(Datenbereich_A22[[#This Row],[AGS]],AGS_Namen!$C$1:$D$58,2,FALSE)","v":"Oldenburg (Oldb), Stadt"},{"v":2794,"d":" 2 794"},{"v":555,"d":"  555"},{"v":2239,"d":" 2 239"},{"v":1713,"d":" 1 713"},{"v":1081,"d":" 1 081"},{"v":2082,"d":" 2 082"},{"v":647,"d":"  647"},{"v":1435,"d":" 1 435"},{"v":1334,"d":" 1 334"},{"v":748,"d":"  748"},{"v":712,"d":"+ 712"},{"v":-92,"d":"- 92"},{"v":804,"d":"+ 804"},{"v":379,"d":"+ 379"},{"v":333,"d":"+ 333"}]
[null,{"v":404,"d":"+ 404"},{"$f":"VLOOKUP(Datenbereich_A22[[#This Row],[AGS]],AGS_Namen!$C$1:$D$58,2,FALSE)","v":"Osnabrück, Stadt"},{"v":2650,"d":" 2 650"},{"v":412,"d":"  412"},{"v":2238,"d":" 2 238"},{"v":1395,"d":" 1 395"},{"v":1255,"d":" 1 255"},{"v":2066,"d":" 2 066"},{"v":488,"d":"  488"},{"v":1578,"d":" 1 578"},{"v":1242,"d":" 1 242"},{"v":824,"d":"  824"},{"v":584,"d":"+ 584"},{"v":-76,"d":"- 76"},{"v":660,"d":"+ 660"},{"v":153,"d":"+ 153"},{"v":431,"d":"+ 431"}]
[null,{"v":405,"d":"+ 405"},{"$f":"VLOOKUP(Datenbereich_A22[[#This Row],[AGS]],AGS_Namen!$C$1:$D$58,2,FALSE)","v":"Wilhelmshaven, Stadt"},{"v":1550,"d":" 1 550"},{"v":338,"d":"  338"},{"v":1212,"d":" 1 212"},{"v":1067,"d":" 1 067"},{"v":483,"d":"  483"},{"v":1242,"d":" 1 242"},{"v":370,"d":"  370"},{"v":872,"d":"  872"},{"v":951,"d":"  951"},{"v":291,"d":"  291"},{"v":308,"d":"+ 308"},{"v":-32,"d":"- 32"},{"v":340,"d":"+ 340"},{"v":116,"d":"+ 116"},{"v":192,"d":"+ 192"}]
[null,{"v":451,"d":"+ 451"},{"$f":"VLOOKUP(Datenbereich_A22[[#This Row],[AGS]],AGS_Namen!$C$1:$D$58,2,FALSE)","v":"Ammerland"},{"v":1900,"d":" 1 900"},{"v":203,"d":"  203"},{"v":1697,"d":" 1 697"},{"v":1192,"d":" 1 192"},{"v":708,"d":"  708"},{"v":1557,"d":" 1 557"},{"v":203,"d":"  203"},{"v":1354,"d":" 1 354"},{"v":1062,"d":" 1 062"},{"v":495,"d":"  495"},{"v":343,"d":"+ 343"},{"v":0,"d":" 0"},{"v":343,"d":"+ 343"},{"v":130,"d":"+ 130"},{"v":213,"d":"+ 213"}]
[null,{"v":452,"d":"+ 452"},{"$f":"VLOOKUP(Datenbereich_A22[[#This Row],[AGS]],AGS_Namen!$C$1:$D$58,2,FALSE)","v":"Aurich"},{"v":1925,"d":" 1 925"},{"v":338,"d":"  338"},{"v":1587,"d":" 1 587"},{"v":1142,"d":" 1 142"},{"v":783,"d":"  783"},{"v":2041,"d":" 2 041"},{"v":403,"d":"  403"},{"v":1638,"d":" 1 638"},{"v":1292,"d":" 1 292"},{"v":749,"d":"  749"},{"v":-116,"d":"- 116"},{"v":-65,"d":"- 65"},{"v":-51,"d":"- 51"},{"v":-150,"d":"- 150"},{"v":34,"d":"+ 34"}]
[null,{"v":453,"d":"+ 453"},{"$f":"VLOOKUP(Datenbereich_A22[[#This Row],[AGS]],AGS_Namen!$C$1:$D$58,2,FALSE)","v":"Cloppenburg"},{"v":9970,"d":" 9 970"},{"v":241,"d":"  241"},{"v":9729,"d":" 9 729"},{"v":6630,"d":" 6 630"},{"v":3340,"d":" 3 340"},{"v":9364,"d":" 9 364"},{"v":269,"d":"  269"},{"v":9095,"d":" 9 095"},{"v":6371,"d":" 6 371"},{"v":2993,"d":" 2 993"},{"v":606,"d":"+ 606"},{"v":-28,"d":"- 28"},{"v":634,"d":"+ 634"},{"v":259,"d":"+ 259"},{"v":347,"d":"+ 347"}]
[null,{"v":454,"d":"+ 454"},{"$f":"VLOOKUP(Datenbereich_A22[[#This Row],[AGS]],AGS_Namen!$C$1:$D$58,2,FALSE)","v":"Emsland"},{"v":10377,"d":" 10 377"},{"v":540,"d":"  540"},{"v":9837,"d":" 9 837"},{"v":7291,"d":" 7 291"},{"v":3086,"d":" 3 086"},{"v":9157,"d":" 9 157"},{"v":656,"d":"  656"},{"v":8501,"d":" 8 501"},{"v":6875,"d":" 6 875"},{"v":2282,"d":" 2 282"},{"v":1220,"d":"+1 220"},{"v":-116,"d":"- 116"},{"v":1336,"d":"+1 336"},{"v":416,"d":"+ 416"},{"v":804,"d":"+ 804"}]
[null,{"v":455,"d":"+ 455"},{"$f":"VLOOKUP(Datenbereich_A22[[#This Row],[AGS]],AGS_Namen!$C$1:$D$58,2,FALSE)","v":"Friesland"},{"v":823,"d":"  823"},{"v":231,"d":"  231"},{"v":592,"d":"  592"},{"v":525,"d":"  525"},{"v":298,"d":"  298"},{"v":751,"d":"  751"},{"v":227,"d":"  227"},{"v":524,"d":"  524"},{"v":493,"d":"  493"},{"v":258,"d":"  258"},{"v":72,"d":"+ 72"},{"v":4,"d":"+ 4"},{"v":68,"d":"+ 68"},{"v":32,"d":"+ 32"},{"v":40,"d":"+ 40"}]
[null,{"v":456,"d":"+ 456"},{"$f":"VLOOKUP(Datenbereich_A22[[#This Row],[AGS]],AGS_Namen!$C$1:$D$58,2,FALSE)","v":"Grafschaft Bentheim"},{"v":2185,"d":" 2 185"},{"v":192,"d":"  192"},{"v":1993,"d":" 1 993"},{"v":1397,"d":" 1 397"},{"v":788,"d":"  788"},{"v":1712,"d":" 1 712"},{"v":227,"d":"  227"},{"v":1485,"d":" 1 485"},{"v":1117,"d":" 1 117"},{"v":595,"d":"  595"},{"v":473,"d":"+ 473"},{"v":-35,"d":"- 35"},{"v":508,"d":"+ 508"},{"v":280,"d":"+ 280"},{"v":193,"d":"+ 193"}]
[null,{"v":457,"d":"+ 457"},{"$f":"VLOOKUP(Datenbereich_A22[[#This Row],[AGS]],AGS_Namen!$C$1:$D$58,2,FALSE)","v":"Leer"},{"v":2601,"d":" 2 601"},{"v":331,"d":"  331"},{"v":2270,"d":" 2 270"},{"v":1835,"d":" 1 835"},{"v":766,"d":"  766"},{"v":2171,"d":" 2 171"},{"v":410,"d":"  410"},{"v":1761,"d":" 1 761"},{"v":1662,"d":" 1 662"},{"v":509,"d":"  509"},{"v":430,"d":"+ 430"},{"v":-79,"d":"- 79"},{"v":509,"d":"+ 509"},{"v":173,"d":"+ 173"},{"v":257,"d":"+ 257"}]
[null,{"v":458,"d":"+ 458"},{"$f":"VLOOKUP(Datenbereich_A22[[#This Row],[AGS]],AGS_Namen!$C$1:$D$58,2,FALSE)","v":"Oldenburg"},{"v":5014,"d":" 5 014"},{"v":235,"d":"  235"},{"v":4779,"d":" 4 779"},{"v":2605,"d":" 2 605"},{"v":2409,"d":" 2 409"},{"v":4535,"d":" 4 535"},{"v":297,"d":"  297"},{"v":4238,"d":" 4 238"},{"v":2380,"d":" 2 380"},{"v":2155,"d":" 2 155"},{"v":479,"d":"+ 479"},{"v":-62,"d":"- 62"},{"v":541,"d":"+ 541"},{"v":225,"d":"+ 225"},{"v":254,"d":"+ 254"}]
[null,{"v":459,"d":"+ 459"},{"$f":"VLOOKUP(Datenbereich_A22[[#This Row],[AGS]],AGS_Namen!$C$1:$D$58,2,FALSE)","v":"Osnabrück"},{"v":8425,"d":" 8 425"},{"v":540,"d":"  540"},{"v":7885,"d":" 7 885"},{"v":5151,"d":" 5 151"},{"v":3274,"d":" 3 274"},{"v":4859,"d":" 4 859"},{"v":754,"d":"  754"},{"v":4105,"d":" 4 105"},{"v":3219,"d":" 3 219"},{"v":1640,"d":" 1 640"},{"v":3566,"d":"+3 566"},{"v":-214,"d":"- 214"},{"v":3780,"d":"+3 780"},{"v":1932,"d":"+1 932"},{"v":1634,"d":"+1 634"}]
[null,{"v":460,"d":"+ 460"},{"$f":"VLOOKUP(Datenbereich_A22[[#This Row],[AGS]],AGS_Namen!$C$1:$D$58,2,FALSE)","v":"Vechta"},{"v":4323,"d":" 4 323"},{"v":322,"d":"  322"},{"v":4001,"d":" 4 001"},{"v":2481,"d":" 2 481"},{"v":1842,"d":" 1 842"},{"v":3812,"d":" 3 812"},{"v":438,"d":"  438"},{"v":3374,"d":" 3 374"},{"v":2321,"d":" 2 321"},{"v":1491,"d":" 1 491"},{"v":511,"d":"+ 511"},{"v":-116,"d":"- 116"},{"v":627,"d":"+ 627"},{"v":160,"d":"+ 160"},{"v":351,"d":"+ 351"}]
[null,{"v":461,"d":"+ 461"},{"$f":"VLOOKUP(Datenbereich_A22[[#This Row],[AGS]],AGS_Namen!$C$1:$D$58,2,FALSE)","v":"Wesermarsch"},{"v":1214,"d":" 1 214"},{"v":231,"d":"  231"},{"v":983,"d":"  983"},{"v":861,"d":"  861"},{"v":353,"d":"  353"},{"v":1096,"d":" 1 096"},{"v":289,"d":"  289"},{"v":807,"d":"  807"},{"v":798,"d":"  798"},{"v":298,"d":"  298"},{"v":118,"d":"+ 118"},{"v":-58,"d":"- 58"},{"v":176,"d":"+ 176"},{"v":63,"d":"+ 63"},{"v":55,"d":"+ 55"}]
[null,{"v":462,"d":"+ 462"},{"$f":"VLOOKUP(Datenbereich_A22[[#This Row],[AGS]],AGS_Namen!$C$1:$D$58,2,FALSE)","v":"Wittmund"},{"v":590,"d":"  590"},{"v":131,"d":"  131"},{"v":459,"d":"  459"},{"v":329,"d":"  329"},{"v":261,"d":"  261"},{"v":444,"d":"  444"},{"v":115,"d":"  115"},{"v":329,"d":"  329"},{"v":255,"d":"  255"},{"v":189,"d":"  189"},{"v":146,"d":"+ 146"},{"v":16,"d":"+ 16"},{"v":130,"d":"+ 130"},{"v":74,"d":"+ 74"},{"v":72,"d":"+ 72"}]
[null,{"v":4,"d":"+ 4"},{"$f":"VLOOKUP(Datenbereich_A22[[#This Row],[AGS]],AGS_Namen!$C$1:$D$58,2,FALSE)","v":"Stat. Region Weser-Ems"},{"v":58716,"d":" 58 716"},{"v":5262,"d":" 5 262"},{"v":53454,"d":" 53 454"},{"v":37098,"d":" 37 098"},{"v":21618,"d":" 21 618"},{"v":48838,"d":" 48 838"},{"v":6332,"d":" 6 332"},{"v":42506,"d":" 42 506"},{"v":32720,"d":" 32 720"},{"v":16118,"d":" 16 118"},{"v":9878,"d":"+9 878"},{"v":-1070,"d":"-1 070"},{"v":10948,"d":"+10 948"},{"v":4378,"d":"+4 378"},{"v":5500,"d":"+5 500"}]
[null,{"v":0,"d":" 0"},{"$f":"VLOOKUP(Datenbereich_A22[[#This Row],[AGS]],AGS_Namen!$C$1:$D$58,2,FALSE)","v":"Niedersachsen"},{"v":151149,"d":" 151 149"},{"v":24510,"d":" 24 510"},{"v":126639,"d":" 126 639"},{"v":92832,"d":" 92 832"},{"v":58317,"d":" 58 317"},{"v":112933,"d":" 112 933"},{"v":23223,"d":" 23 223"},{"v":89710,"d":" 89 710"},{"v":75305,"d":" 75 305"},{"v":37628,"d":" 37 628"},{"v":38216,"d":"+38 216"},{"v":1287,"d":"+1 287"},{"v":36929,"d":"+36 929"},{"v":17527,"d":"+17 527"},{"v":20689,"d":"+20 689"}]
[]
[]
[null,null,"Quelle: Wanderungsstatistik"]
[]
[null,null,"Karte A22-2: Saldo der Zu- und Fortzüge über die Bundesgrenzen 2019 je 1 000 Einwohnerinnen und Einwohner"]
{"$rows_empty":24}
[null,null,{"$f":"Def","v":"Die Definition zu dem Indikator sowie methodische Hinweise finden Sie in der Tabelle Aktuelle Ergebnisse"}]
[null,null,"Link zur LSN-Online-Datenbank"]
[null,null,"Link zum Regionalmonitoring Niedersachsen"]

{"sheet":"B2","index":17,"n_rows":114,"n_cols":17,"rows_kept":114,"merged":[[2,2,2,4],[4,2,4,9],[5,2,5,10],[9,2,11,2],[9,3,9,4],[9,5,9,6],[9,7,9,8],[9,9,9,10],[9,11,9,12],[9,13,9,14],[9,15,9,16],[11,3,11,12],[71,2,71,10],[113,2,113,6]]}
[null,null,{"$f":"Kopf","v":"Migration und Teilhabe in Niedersachsen - Integrationsmonitoring 2020 - Regionalinformationen "}]
[]
[]
[]
[null,null,"Indikator B2: Anteil der betreuten Kinder bis unter 6 Jahren mit Zuwanderungsgeschichte in Tageseinrichtungen"]
[null,null,"Tabelle B2-2: Anteil der betreuten Kinder bis unter 6 Jahren mit Zuwanderungsgeschichte in Tageseinrichtungen (jeweils 01. März) nach Kreisen"]
[]
[]
[]
[null,null,"Kreisfreie Stadt\nLandkreis\n(Großstadt, Umland)\nStatistische Region\nLand","Anteil der betreuten Kinder mit Migrationshintergrund an allen betreuten Kindern 2013",null,"Anteil der betreuten Kinder mit Migrationshintergrund an allen betreuten Kindern 2014",null,"Anteil der betreuten Kinder mit Migrationshintergrund an allen betreuten Kindern 2015",null,"Anteil der betreuten Kinder mit Migrationshintergrund an allen betreuten Kindern 2016",null,"Anteil der betreuten Kinder mit Migrationshintergrund an allen betreuten Kindern 2017",null,"Anteil der betreuten Kinder mit Migrationshintergrund an allen betreuten Kindern 2018",null,"Anteil der betreuten Kinder mit Migrationshintergrund an allen betreuten Kindern 2019"]
[{"$nulls":3},"ausländische Herkunft mindestens eines Elternteils","in der Familie wird vorrangig nicht deutsch gesprochen","ausländische Herkunft mindestens eines Elternteils","in der Familie wird vorrangig nicht deutsch gesprochen","ausländische Herkunft mindestens eines Elternteils","in der Familie wird vorrangig nicht deutsch gesprochen","ausländische Herkunft mindestens eines Elternteils","in der Familie wird vorrangig nicht deutsch gesprochen","ausländische Herkunft mindestens eines Elternteils","in der Familie wird vorrangig nicht deutsch gesprochen","ausländische Herkunft mindestens eines Elternteils","in der Familie wird vorrangig nicht deutsch gesprochen","ausländische Herkunft mindestens eines Elternteils","in der Familie wird vorrangig nicht deutsch gesprochen"]
[{"$nulls":3},"Prozent"]
[null,"Spalte1","1","2","3","4","5","6","7","8","9","10","11","12","13","14","15"]
[null,101,{"$f":"VLOOKUP(B14,AGS_Namen!$C$1:$D$58,2,FALSE)","v":"Braunschweig, Stadt"},31.8,16.8,32.1,16.9,{"v":31.990747040413662,"d":"32.0"},{"v":16.138250102054702,"d":"16.1"},{"v":32.43504298271033,"d":"32.4"},{"v":15.831160050226988,"d":"15.8"},{"v":32.296015180265655,"d":"32.3"},{"v":16.669829222011384,"d":"16.7"},{"v":33.765532144786604,"d":"33.8"},{"v":18.787142085359264,"d":"18.8"},{"v":35.46811039218276,"d":"35.5"},{"v":21.36537699722699,"d":"21.4"}]
[null,102,{"$f":"VLOOKUP(B15,AGS_Namen!$C$1:$D$58,2,FALSE)","v":"Salzgitter, Stadt"},34.7,26.1,38.3,26.7,{"v":39.97093023255814,"d":"40.0"},{"v":27.507267441860467,"d":"27.5"},{"v":40.435374149659864,"d":"40.4"},{"v":28.843537414965986,"d":"28.8"},{"v":37.85187209620115,"d":"37.9"},{"v":30.1448483192129,"d":"30.1"},{"v":42.45718050065876,"d":"42.5"},{"v":30.500658761528328,"d":"30.5"},{"v":43.22497586095913,"d":"43.2"},{"v":30.57611844222723,"d":"30.6"}]
[null,103,{"$f":"VLOOKUP(B16,AGS_Namen!$C$1:$D$58,2,FALSE)","v":"Wolfsburg, Stadt"},30.8,17.1,{"v":30,"d":"30.0"},19.4,{"v":30.616253375890008,"d":"30.6"},{"v":21.163761355266388,"d":"21.2"},{"v":31.17356790388329,"d":"31.2"},{"v":23.299721089894874,"d":"23.3"},{"v":31.39830508474576,"d":"31.4"},{"v":25.783898305084747,"d":"25.8"},{"v":31.01791175185671,"d":"31.0"},{"v":18.15203145478375,"d":"18.2"},{"v":40.37687910226551,"d":"40.4"},{"v":27.800127037899642,"d":"27.8"}]
[null,151,{"$f":"VLOOKUP(B17,AGS_Namen!$C$1:$D$58,2,FALSE)","v":"Gifhorn"},15.2,8.4,16.3,8.5,{"v":17.194478278522126,"d":"17.2"},{"v":8.891595615103533,"d":"8.9"},{"v":13.413269384492406,"d":"13.4"},{"v":8.601119104716227,"d":"8.6"},{"v":14.465023725700291,"d":"14.5"},{"v":8.648400428593295,"d":"8.6"},{"v":14.856146469049694,"d":"14.9"},{"v":7.061900610287706,"d":"7.1"},{"v":17.785784474287585,"d":"17.8"},{"v":8.794628234523419,"d":"8.8"}]
[null,152,{"$f":"VLOOKUP(B18,AGS_Namen!$C$1:$D$58,2,FALSE)","v":"Göttingen (bis 31.10.2016)"},23.2,13.6,24.2,14.2,{"v":25.782638414217363,"d":"25.8"},{"v":14.43609022556391,"d":"14.4"},"-","-","-","-","-","-","-","-"]
[null,153,{"$f":"VLOOKUP(B19,AGS_Namen!$C$1:$D$58,2,FALSE)","v":"Goslar"},17.4,7.8,16.1,7.9,{"v":15.893827950111927,"d":"15.9"},{"v":8.794371602174609,"d":"8.8"},{"v":15.798922800718133,"d":"15.8"},{"v":9.823031546550398,"d":"9.8"},{"v":18.290891283055828,"d":"18.3"},{"v":10.798237022526934,"d":"10.8"},{"v":23.52941176470588,"d":"23.5"},{"v":11.37408088235294,"d":"11.4"},{"v":21.960553429496617,"d":"22.0"},{"v":14.718869590815425,"d":"14.7"}]
[null,154,{"$f":"VLOOKUP(B20,AGS_Namen!$C$1:$D$58,2,FALSE)","v":"Helmstedt"},8.9,3.2,9.7,4.2,{"v":12.8659793814433,"d":"12.9"},{"v":5.154639175257731,"d":"5.2"},{"v":13.01346220227822,"d":"13.0"},{"v":7.352433551950293,"d":"7.4"},{"v":13.539270456786067,"d":"13.5"},{"v":7.854091357213276,"d":"7.9"},{"v":17.535675082327113,"d":"17.5"},{"v":9.522502744237102,"d":"9.5"},{"v":12.974340440910733,"d":"13.0"},{"v":7.770148174918684,"d":"7.8"}]
[null,155,{"$f":"VLOOKUP(B21,AGS_Namen!$C$1:$D$58,2,FALSE)","v":"Northeim"},{"v":16,"d":"16.0"},9.4,16.4,9.4,{"v":18.955963837853602,"d":"19.0"},{"v":9.827938174394868,"d":"9.8"},{"v":19.985925404644618,"d":"20.0"},{"v":11.47079521463758,"d":"11.5"},{"v":20.853630248202272,"d":"20.9"},{"v":13.546740895383902,"d":"13.5"},{"v":25.17879680269247,"d":"25.2"},{"v":15.576356752208667,"d":"15.6"},{"v":21.944739638682254,"d":"21.9"},{"v":13.682252922422954,"d":"13.7"}]
[null,156,{"$f":"VLOOKUP(B22,AGS_Namen!$C$1:$D$58,2,FALSE)","v":"Osterode am Harz (bis 31.10.2016)"},16.2,6.3,15.3,9.3,{"v":13.422007255139057,"d":"13.4"},{"v":9.068923821039904,"d":"9.1"},"-","-","-","-","-","-","-","-"]
[null,157,{"$f":"VLOOKUP(B23,AGS_Namen!$C$1:$D$58,2,FALSE)","v":"Peine"},21.4,11.9,21.1,11.6,{"v":20.514152168267984,"d":"20.5"},{"v":10.412879771487924,"d":"10.4"},{"v":21.140241364960467,"d":"21.1"},{"v":9.779442363712027,"d":"9.8"},{"v":24.20971472629144,"d":"24.2"},{"v":14.090208172706244,"d":"14.1"},{"v":36.486838676049,"d":"36.5"},{"v":23.716445139431848,"d":"23.7"},{"v":24.062153163152054,"d":"24.1"},{"v":11.542730299667037,"d":"11.5"}]
[null,158,{"$f":"VLOOKUP(B24,AGS_Namen!$C$1:$D$58,2,FALSE)","v":"Wolfenbüttel"},14.2,7.6,13.3,7.3,{"v":12.738095238095237,"d":"12.7"},{"v":7.529761904761904,"d":"7.5"},{"v":14.586672773070758,"d":"14.6"},{"v":8.930615983512709,"d":"8.9"},{"v":16.402941831958994,"d":"16.4"},{"v":9.962112770225096,"d":"10.0"},{"v":17.527772879562686,"d":"17.5"},{"v":10.068770939869513,"d":"10.1"},{"v":18.227915665866025,"d":"18.2"},{"v":10.328262610088071,"d":"10.3"}]
[null,159,{"$f":"VLOOKUP(B25,AGS_Namen!$C$1:$D$58,2,FALSE)","v":"Göttingen"},"-","-","-","-","-","-",{"v":23.408677578591842,"d":"23.4"},{"v":14.462630986403395,"d":"14.5"},{"v":24.193548387096776,"d":"24.2"},{"v":14.99151103565365,"d":"15.0"},{"v":20.664869721473494,"d":"20.7"},{"v":14.405510631925727,"d":"14.4"},{"v":26.596289843189503,"d":"26.6"},{"v":18.60202931228861,"d":"18.6"}]
[null,1,{"$f":"VLOOKUP(B26,AGS_Namen!$C$1:$D$58,2,FALSE)","v":"Stat. Region Braunschweig"},22.2,12.4,22.6,12.9,{"v":23.338831025055917,"d":"23.3"},{"v":13.194460134203927,"d":"13.2"},{"v":23.51250815365901,"d":"23.5"},{"v":13.994323290376038,"d":"14.0"},{"v":24.194018339189306,"d":"24.2"},{"v":15.168394892450081,"d":"15.2"},{"v":24.96508598228244,"d":"25.0"},{"v":14.774361646690984,"d":"14.8"},{"v":26.928366298588358,"d":"26.9"},{"v":16.927557335274845,"d":"16.9"}]
[null,241,{"$f":"VLOOKUP(B27,AGS_Namen!$C$1:$D$58,2,FALSE)","v":"Hannover, Region"},34.5,20.3,34.5,20.6,{"v":34.56101931116862,"d":"34.6"},{"v":21.623389550922898,"d":"21.6"},{"v":34.799289810412034,"d":"34.8"},{"v":21.80975898451052,"d":"21.8"},{"v":34.84702674525843,"d":"34.8"},{"v":23.475279682425118,"d":"23.5"},{"v":36.62836662625837,"d":"36.6"},{"v":23.40694671375112,"d":"23.4"},{"v":38.21773439933548,"d":"38.2"},{"v":24.888381268819437,"d":"24.9"}]
[null,241001,{"$f":"VLOOKUP(B28,AGS_Namen!$C$1:$D$58,2,FALSE)","v":"   dav. Hannover, Lhst."},44.8,29.3,44.1,28.5,{"v":44.360991188124665,"d":"44.4"},{"v":29.368975102016677,"d":"29.4"},{"v":45.26906401428207,"d":"45.3"},{"v":30.030604437643458,"d":"30.0"},{"v":45.410607716230984,"d":"45.4"},{"v":31.381860973354627,"d":"31.4"},{"v":47.073252313524364,"d":"47.1"},{"v":32.07157988627495,"d":"32.1"},{"v":47.57281553398058,"d":"47.6"},{"v":31.988904299583908,"d":"32.0"}]
[null,241999,{"$f":"VLOOKUP(B29,AGS_Namen!$C$1:$D$58,2,FALSE)","v":"   dav. Hannover, Umland"},25.4,12.3,25.6,13.2,{"v":25.482138943677406,"d":"25.5"},{"v":14.447731755424062,"d":"14.4"},{"v":25.13052011776251,"d":"25.1"},{"v":14.217860647693817,"d":"14.2"},{"v":25.210857230486123,"d":"25.2"},{"v":16.26284312222052,"d":"16.3"},{"v":27.264094362255097,"d":"27.3"},{"v":15.63874450219912,"d":"15.6"},{"v":29.99170691253232,"d":"30.0"},{"v":18.64481194204595,"d":"18.6"}]
[null,251,{"$f":"VLOOKUP(B30,AGS_Namen!$C$1:$D$58,2,FALSE)","v":"Diepholz"},19.1,10.9,18.5,11.1,{"v":18.298090040927693,"d":"18.3"},{"v":12.278308321964529,"d":"12.3"},{"v":20.203058732810693,"d":"20.2"},{"v":13.391594910679862,"d":"13.4"},{"v":20.488793212612386,"d":"20.5"},{"v":15.119665695833861,"d":"15.1"},{"v":20.894598359387093,"d":"20.9"},{"v":14.223804364649434,"d":"14.2"},{"v":22.862562007586813,"d":"22.9"},{"v":17.070323898453456,"d":"17.1"}]
[null,252,{"$f":"VLOOKUP(B31,AGS_Namen!$C$1:$D$58,2,FALSE)","v":"Hameln-Pyrmont"},24.2,12.6,25.5,{"v":13,"d":"13.0"},{"v":22.23605577689243,"d":"22.2"},{"v":12.823705179282868,"d":"12.8"},{"v":26.4066852367688,"d":"26.4"},{"v":15.896007428040853,"d":"15.9"},{"v":27.549128661475713,"d":"27.5"},{"v":16.740823136818687,"d":"16.7"},{"v":28.211826169555927,"d":"28.2"},{"v":16.290667299928757,"d":"16.3"},{"v":30.973451327433626,"d":"31.0"},{"v":19.78670297254368,"d":"19.8"}]
[null,254,{"$f":"VLOOKUP(B32,AGS_Namen!$C$1:$D$58,2,FALSE)","v":"Hildesheim"},22.8,11.5,22.5,11.2,{"v":22.547564431250844,"d":"22.5"},{"v":12.117123195250304,"d":"12.1"},{"v":24.623217922606926,"d":"24.6"},{"v":14.134419551934826,"d":"14.1"},{"v":25.061789421651014,"d":"25.1"},{"v":14.710825506673258,"d":"14.7"},{"v":24.413379930104842,"d":"24.4"},{"v":13.492261607588619,"d":"13.5"},{"v":27.0609756097561,"d":"27.1"},{"v":18.365853658536587,"d":"18.4"}]
[null,255,{"$f":"VLOOKUP(B33,AGS_Namen!$C$1:$D$58,2,FALSE)","v":"Holzminden"},21.4,7.7,19.7,8.8,{"v":17.416378316032297,"d":"17.4"},{"v":7.7854671280276815,"d":"7.8"},{"v":15.956969968623936,"d":"16.0"},{"v":8.292245629762439,"d":"8.3"},{"v":17.393238434163703,"d":"17.4"},{"v":9.47508896797153,"d":"9.5"},{"v":18.355119825708062,"d":"18.4"},{"v":10.403050108932462,"d":"10.4"},{"v":24.4432936302434,"d":"24.4"},{"v":14.396685655100985,"d":"14.4"}]
[null,256,{"$f":"VLOOKUP(B34,AGS_Namen!$C$1:$D$58,2,FALSE)","v":"Nienburg (Weser)"},22.2,8.7,21.3,9.9,{"v":20.542517525144774,"d":"20.5"},{"v":8.899725693386163,"d":"8.9"},{"v":21.847246891651864,"d":"21.8"},{"v":10.37807663029688,"d":"10.4"},{"v":20.004837929366232,"d":"20.0"},{"v":11.127237542331882,"d":"11.1"},{"v":19.717160728855045,"d":"19.7"},{"v":11.367963013326081,"d":"11.4"},{"v":20.423444358378518,"d":"20.4"},{"v":12.393493415956623,"d":"12.4"}]
[null,257,{"$f":"VLOOKUP(B35,AGS_Namen!$C$1:$D$58,2,FALSE)","v":"Schaumburg"},20.5,8.4,20.3,9.2,{"v":22.60448521916412,"d":"22.6"},{"v":11.365953109072375,"d":"11.4"},{"v":23.12015503875969,"d":"23.1"},{"v":11.065891472868216,"d":"11.1"},{"v":25.523881442325845,"d":"25.5"},{"v":13.838021521616009,"d":"13.8"},{"v":25.693160813308687,"d":"25.7"},{"v":15.226432532347506,"d":"15.2"},{"v":28.337696335078533,"d":"28.3"},{"v":19.76439790575916,"d":"19.8"}]
[null,2,{"$f":"VLOOKUP(B36,AGS_Namen!$C$1:$D$58,2,FALSE)","v":"Stat. Region Hannover"},28.9,{"v":16,"d":"16.0"},28.8,16.4,{"v":28.75340033555407,"d":"28.8"},{"v":17.281034679350395,"d":"17.3"},{"v":29.85393487679881,"d":"29.9"},{"v":18.16872502070356,"d":"18.2"},{"v":30.118992973411956,"d":"30.1"},{"v":19.655614797029294,"d":"19.7"},{"v":30.94131275292985,"d":"30.9"},{"v":19.31067683651517,"d":"19.3"},{"v":32.8141225337487,"d":"32.8"},{"v":21.645971362964914,"d":"21.6"}]
[null,351,{"$f":"VLOOKUP(B37,AGS_Namen!$C$1:$D$58,2,FALSE)","v":"Celle"},13.1,5.7,15.1,8.8,{"v":13.346080305927345,"d":"13.3"},{"v":6.061185468451242,"d":"6.1"},{"v":12.521150592216582,"d":"12.5"},{"v":6.362098138747885,"d":"6.4"},{"v":18.711608127264135,"d":"18.7"},{"v":11.560875728461175,"d":"11.6"},{"v":18.697740615548835,"d":"18.7"},{"v":10.620885963351718,"d":"10.6"},{"v":20.274020117932707,"d":"20.3"},{"v":11.29032258064516,"d":"11.3"}]
[null,352,{"$f":"VLOOKUP(B38,AGS_Namen!$C$1:$D$58,2,FALSE)","v":"Cuxhaven"},{"v":15,"d":"15.0"},{"v":7,"d":"7.0"},14.8,7.2,{"v":14.788990825688073,"d":"14.8"},{"v":8.440366972477065,"d":"8.4"},{"v":17.160073356038772,"d":"17.2"},{"v":10.086455331412104,"d":"10.1"},{"v":19.05491698595147,"d":"19.1"},{"v":12.171136653895275,"d":"12.2"},{"v":17.069914900717503,"d":"17.1"},{"v":10.29534456866344,"d":"10.3"},{"v":16.818625854770435,"d":"16.8"},{"v":9.980462390100945,"d":"10.0"}]
[null,353,{"$f":"VLOOKUP(B39,AGS_Namen!$C$1:$D$58,2,FALSE)","v":"Harburg"},18.2,9.2,18.7,9.2,{"v":18.992443324937028,"d":"19.0"},{"v":9.420654911838792,"d":"9.4"},{"v":19.48673336233145,"d":"19.5"},{"v":9.69986950848195,"d":"9.7"},{"v":19.187114004339843,"d":"19.2"},{"v":10.115172759138709,"d":"10.1"},{"v":20.87975192373952,"d":"20.9"},{"v":11.278281842195934,"d":"11.3"},{"v":20.996559760292975,"d":"21.0"},{"v":11.563644434579958,"d":"11.6"}]
[null,354,{"$f":"VLOOKUP(B40,AGS_Namen!$C$1:$D$58,2,FALSE)","v":"Lüchow-Dannenberg"},12.4,5.7,10.7,5.2,{"v":12.34866828087167,"d":"12.3"},{"v":6.779661016949152,"d":"6.8"},{"v":14.664981036662452,"d":"14.7"},{"v":9.481668773704172,"d":"9.5"},{"v":15.504358655043587,"d":"15.5"},{"v":10.149439601494397,"d":"10.1"},{"v":15.555555555555555,"d":"15.6"},{"v":9.50191570881226,"d":"9.5"},{"v":13.086232980332829,"d":"13.1"},{"v":9.909228441754916,"d":"9.9"}]
[null,355,{"$f":"VLOOKUP(B41,AGS_Namen!$C$1:$D$58,2,FALSE)","v":"Lüneburg"},15.9,9.4,15.5,8.9,{"v":15.52212389380531,"d":"15.5"},{"v":8.902654867256638,"d":"8.9"},{"v":19.629225736095965,"d":"19.6"},{"v":11.382224645583424,"d":"11.4"},{"v":21.090765380055327,"d":"21.1"},{"v":12.422605717296799,"d":"12.4"},{"v":20.994659546061413,"d":"21.0"},{"v":11.4652870493992,"d":"11.5"},{"v":20.73507887461376,"d":"20.7"},{"v":12.441047324768254,"d":"12.4"}]
[null,356,{"$f":"VLOOKUP(B42,AGS_Namen!$C$1:$D$58,2,FALSE)","v":"Osterholz"},13.7,6.1,13.4,7.4,{"v":13.659466327827191,"d":"13.7"},{"v":7.083862770012707,"d":"7.1"},{"v":15.402124430955993,"d":"15.4"},{"v":8.649468892261002,"d":"8.6"},{"v":15.908532087533809,"d":"15.9"},{"v":9.761494959429555,"d":"9.8"},{"v":17.211511595417715,"d":"17.2"},{"v":7.991058955015368,"d":"8.0"},{"v":19.189765458422176,"d":"19.2"},{"v":11.3272921108742,"d":"11.3"}]
[null,357,{"$f":"VLOOKUP(B43,AGS_Namen!$C$1:$D$58,2,FALSE)","v":"Rotenburg (Wümme)"},13.1,5.4,14.9,5.6,{"v":13.413830954994513,"d":"13.4"},{"v":5.729967069154775,"d":"5.7"},{"v":15.489330389992642,"d":"15.5"},{"v":8.425312729948491,"d":"8.4"},{"v":14.701072142467744,"d":"14.7"},{"v":9.46756314737416,"d":"9.5"},{"v":17.315658657829328,"d":"17.3"},{"v":8.906379453189727,"d":"8.9"},{"v":18.410041841004183,"d":"18.4"},{"v":10.44032675831839,"d":"10.4"}]
[null,358,{"$f":"VLOOKUP(B44,AGS_Namen!$C$1:$D$58,2,FALSE)","v":"Heidekreis"},16.2,7.4,18.4,7.8,{"v":15.668435683598686,"d":"15.7"},{"v":7.050796057619409,"d":"7.1"},{"v":16.19520621895919,"d":"16.2"},{"v":9.155689915784928,"d":"9.2"},{"v":16.705483802667796,"d":"16.7"},{"v":10.67118356976498,"d":"10.7"},{"v":19.022265246853824,"d":"19.0"},{"v":10.382381413359148,"d":"10.4"},{"v":21.150672011318086,"d":"21.2"},{"v":13.204432916764913,"d":"13.2"}]
[null,359,{"$f":"VLOOKUP(B45,AGS_Namen!$C$1:$D$58,2,FALSE)","v":"Stade"},16.2,8.4,14.4,7.9,{"v":16.545423786161393,"d":"16.5"},{"v":8.797157841312806,"d":"8.8"},{"v":16.653290529695024,"d":"16.7"},{"v":8.868378812199037,"d":"8.9"},{"v":19.24011769220929,"d":"19.2"},{"v":10.822566201867724,"d":"10.8"},{"v":18.24935400516796,"d":"18.2"},{"v":10.368217054263566,"d":"10.4"},{"v":18.998931786967802,"d":"19.0"},{"v":10.514268274072943,"d":"10.5"}]
[null,360,{"$f":"VLOOKUP(B46,AGS_Namen!$C$1:$D$58,2,FALSE)","v":"Uelzen"},13.1,5.4,14.6,4.6,{"v":13.678618857901725,"d":"13.7"},{"v":4.869411243913236,"d":"4.9"},{"v":16.3558106169297,"d":"16.4"},{"v":6.958393113342898,"d":"7.0"},{"v":16.543470608940513,"d":"16.5"},{"v":8.623724040830693,"d":"8.6"},{"v":18.480909829406986,"d":"18.5"},{"v":8.935824532900082,"d":"8.9"},{"v":20.41480276535177,"d":"20.4"},{"v":9.31272875152501,"d":"9.3"}]
[null,361,{"$f":"VLOOKUP(B47,AGS_Namen!$C$1:$D$58,2,FALSE)","v":"Verden"},20.8,10.7,20.5,10.6,{"v":21.064356435643564,"d":"21.1"},{"v":10.272277227722771,"d":"10.3"},{"v":21.889908256880734,"d":"21.9"},{"v":12.110091743119266,"d":"12.1"},{"v":20.92941998602376,"d":"20.9"},{"v":13.242487770789658,"d":"13.2"},{"v":22.623163353500434,"d":"22.6"},{"v":13.439930855661192,"d":"13.4"},{"v":23.76595744680851,"d":"23.8"},{"v":13.957446808510637,"d":"14.0"}]
[null,3,{"$f":"VLOOKUP(B48,AGS_Namen!$C$1:$D$58,2,FALSE)","v":"Stat. Region Lüneburg"},15.7,7.6,16.1,{"v":8,"d":"8.0"},{"v":15.879219911298325,"d":"15.9"},{"v":7.938597379452804,"d":"7.9"},{"v":17.360108019845505,"d":"17.4"},{"v":9.399924637317088,"d":"9.4"},{"v":18.545272818136386,"d":"18.5"},{"v":11.018733057713568,"d":"11.0"},{"v":19.130223245195456,"d":"19.1"},{"v":10.54660453975561,"d":"10.5"},{"v":19.862466886816417,"d":"19.9"},{"v":11.403636099720579,"d":"11.4"}]
[null,401,{"$f":"VLOOKUP(B49,AGS_Namen!$C$1:$D$58,2,FALSE)","v":"Delmenhorst, Stadt"},26.2,17.4,33.4,22.1,{"v":30.94194961664841,"d":"30.9"},{"v":20.700985761226725,"d":"20.7"},{"v":43.913978494623656,"d":"43.9"},{"v":32,"d":"32.0"},{"v":45.852828583581456,"d":"45.9"},{"v":33.51765206295194,"d":"33.5"},{"v":42.87917737789203,"d":"42.9"},{"v":31.208226221079695,"d":"31.2"},{"v":43.372319688109165,"d":"43.4"},{"v":30.50682261208577,"d":"30.5"}]
[null,402,{"$f":"VLOOKUP(B50,AGS_Namen!$C$1:$D$58,2,FALSE)","v":"Emden, Stadt"},20.2,10.4,21.5,11.5,{"v":21.342756183745585,"d":"21.3"},{"v":11.731448763250883,"d":"11.7"},{"v":23.75846501128668,"d":"23.8"},{"v":15.18058690744921,"d":"15.2"},{"v":26.208791208791208,"d":"26.2"},{"v":19.285714285714285,"d":"19.3"},{"v":24.685638649900728,"d":"24.7"},{"v":16.082064857710126,"d":"16.1"},{"v":27.135348226018397,"d":"27.1"},{"v":19.185282522996058,"d":"19.2"}]
[null,403,{"$f":"VLOOKUP(B51,AGS_Namen!$C$1:$D$58,2,FALSE)","v":"Oldenburg (Oldb), Stadt"},25.9,14.8,17.4,19.8,{"v":25.93287471336252,"d":"25.9"},{"v":16.78132165937044,"d":"16.8"},{"v":27.56032960565038,"d":"27.6"},{"v":23.675691583284284,"d":"23.7"},{"v":28.46846846846847,"d":"28.5"},{"v":26.5003465003465,"d":"26.5"},{"v":28.088207811623995,"d":"28.1"},{"v":19.603812371519343,"d":"19.6"},{"v":28.37440235380655,"d":"28.4"},{"v":19.713129827142332,"d":"19.7"}]
[null,404,{"$f":"VLOOKUP(B52,AGS_Namen!$C$1:$D$58,2,FALSE)","v":"Osnabrück, Stadt"},36.9,22.3,37.4,24.3,{"v":27.1633118904337,"d":"27.2"},{"v":16.497198588918863,"d":"16.5"},{"v":30.099212138896995,"d":"30.1"},{"v":13.83133936387511,"d":"13.8"},{"v":38.813631826607725,"d":"38.8"},{"v":24.440325110509054,"d":"24.4"},{"v":37.295990328430385,"d":"37.3"},{"v":26.032641547451142,"d":"26.0"},{"v":35.87542423637453,"d":"35.9"},{"v":27.370732681173887,"d":"27.4"}]
[null,405,{"$f":"VLOOKUP(B53,AGS_Namen!$C$1:$D$58,2,FALSE)","v":"Wilhelmshaven, Stadt"},24.2,14.8,21.5,9.9,{"v":19.939209726443767,"d":"19.9"},{"v":8.875379939209726,"d":"8.9"},{"v":24.57116365322207,"d":"24.6"},{"v":12.285581826611034,"d":"12.3"},{"v":24.77638640429338,"d":"24.8"},{"v":13.237924865831843,"d":"13.2"},{"v":25.593220338983052,"d":"25.6"},{"v":12.372881355932204,"d":"12.4"},{"v":25.216450216450216,"d":"25.2"},{"v":13.257575757575758,"d":"13.3"}]
[null,451,{"$f":"VLOOKUP(B54,AGS_Namen!$C$1:$D$58,2,FALSE)","v":"Ammerland"},12.8,6.4,12.6,{"v":5,"d":"5.0"},{"v":13.314037626628075,"d":"13.3"},{"v":6.628075253256151,"d":"6.6"},{"v":15.738610216290843,"d":"15.7"},{"v":7.179015186378279,"d":"7.2"},{"v":17.59530791788856,"d":"17.6"},{"v":8.639747349424768,"d":"8.6"},{"v":17.23504721930745,"d":"17.2"},{"v":10.047219307450158,"d":"10.0"},{"v":18.667013798489975,"d":"18.7"},{"v":12.054152564436345,"d":"12.1"}]
[null,452,{"$f":"VLOOKUP(B55,AGS_Namen!$C$1:$D$58,2,FALSE)","v":"Aurich"},12.5,7.1,11.9,6.4,{"v":11.169354838709678,"d":"11.2"},{"v":6.713709677419355,"d":"6.7"},{"v":14.902912621359222,"d":"14.9"},{"v":8.980582524271844,"d":"9.0"},{"v":14.74492243723013,"d":"14.7"},{"v":10.602910602910603,"d":"10.6"},{"v":15.207814594905193,"d":"15.2"},{"v":9.538402604864968,"d":"9.5"},{"v":14.398385913426266,"d":"14.4"},{"v":8.749082905355833,"d":"8.7"}]
[null,453,{"$f":"VLOOKUP(B56,AGS_Namen!$C$1:$D$58,2,FALSE)","v":"Cloppenburg"},{"v":30,"d":"30.0"},12.5,{"v":24,"d":"24.0"},11.6,{"v":24.1483571860512,"d":"24.1"},{"v":13.42471275952429,"d":"13.4"},{"v":24.824120603015075,"d":"24.8"},{"v":15.845896147403685,"d":"15.8"},{"v":22.86075149984212,"d":"22.9"},{"v":18.80328386485633,"d":"18.8"},{"v":22.287546766435064,"d":"22.3"},{"v":13.468733297701762,"d":"13.5"},{"v":22.363513055272975,"d":"22.4"},{"v":13.089182773821634,"d":"13.1"}]
[null,454,{"$f":"VLOOKUP(B57,AGS_Namen!$C$1:$D$58,2,FALSE)","v":"Emsland"},18.1,{"v":9,"d":"9.0"},17.6,10.7,{"v":17.96851499047428,"d":"18.0"},{"v":12.774491126040308,"d":"12.8"},{"v":20.400139786825093,"d":"20.4"},{"v":14.266992835925214,"d":"14.3"},{"v":20.90760425183974,"d":"20.9"},{"v":10.784955028618151,"d":"10.8"},{"v":20.336822940373235,"d":"20.3"},{"v":11.970869367319072,"d":"12.0"},{"v":21.70299380883725,"d":"21.7"},{"v":14.070053430582648,"d":"14.1"}]
[null,455,{"$f":"VLOOKUP(B58,AGS_Namen!$C$1:$D$58,2,FALSE)","v":"Friesland"},9.6,4.7,8.4,3.9,{"v":7.913669064748201,"d":"7.9"},{"v":4.619462324876941,"d":"4.6"},{"v":8.354591836734693,"d":"8.4"},{"v":6.25,"d":"6.3"},{"v":10.76591817902184,"d":"10.8"},{"v":8.458935712088588,"d":"8.5"},{"v":10.132311977715878,"d":"10.1"},{"v":5.605849582172702,"d":"5.6"},{"v":10.185799601857996,"d":"10.2"},{"v":4.57863304578633,"d":"4.6"}]
[null,456,{"$f":"VLOOKUP(B59,AGS_Namen!$C$1:$D$58,2,FALSE)","v":"Grafschaft Bentheim"},24.5,15.1,25.7,14.9,{"v":27.437258687258687,"d":"27.4"},{"v":15.78185328185328,"d":"15.8"},{"v":27.906976744186046,"d":"27.9"},{"v":20.25979467839933,"d":"20.3"},{"v":28.491271820448876,"d":"28.5"},{"v":18.266832917705734,"d":"18.3"},{"v":29.585398828301035,"d":"29.6"},{"v":20.009013068949976,"d":"20.0"},{"v":28.427507665352607,"d":"28.4"},{"v":18.57205431449847,"d":"18.6"}]
[null,457,{"$f":"VLOOKUP(B60,AGS_Namen!$C$1:$D$58,2,FALSE)","v":"Leer"},{"v":14,"d":"14.0"},6.6,15.4,7.6,{"v":14.916286149162861,"d":"14.9"},{"v":7.588606218743204,"d":"7.6"},{"v":14.88477521722705,"d":"14.9"},{"v":8.59463543634303,"d":"8.6"},{"v":17.968032335109314,"d":"18.0"},{"v":10.802866066507441,"d":"10.8"},{"v":14.967637540453074,"d":"15.0"},{"v":8.818770226537216,"d":"8.8"},{"v":16.848763657274297,"d":"16.8"},{"v":10.178263369752731,"d":"10.2"}]
[null,458,{"$f":"VLOOKUP(B61,AGS_Namen!$C$1:$D$58,2,FALSE)","v":"Oldenburg"},13.6,7.1,11.3,7.3,{"v":12.104836530667388,"d":"12.1"},{"v":7.943798973250472,"d":"7.9"},{"v":10.937843180320668,"d":"10.9"},{"v":6.852624643092467,"d":"6.9"},{"v":14.708368554522401,"d":"14.7"},{"v":9.467455621301776,"d":"9.5"},{"v":14.032016008004003,"d":"14.0"},{"v":9.229614807403703,"d":"9.2"},{"v":14.768856447688563,"d":"14.8"},{"v":10.997566909975669,"d":"11.0"}]
[null,459,{"$f":"VLOOKUP(B62,AGS_Namen!$C$1:$D$58,2,FALSE)","v":"Osnabrück"},21.5,11.3,{"v":20,"d":"20.0"},10.3,{"v":18.10353263528721,"d":"18.1"},{"v":9.130051864174577,"d":"9.1"},{"v":19.46895218889169,"d":"19.5"},{"v":10.175615494496261,"d":"10.2"},{"v":18.755577188285876,"d":"18.8"},{"v":9.304778129309646,"d":"9.3"},{"v":18.984076149808736,"d":"19.0"},{"v":9.687750200160128,"d":"9.7"},{"v":20.672993960310613,"d":"20.7"},{"v":12.260569456427955,"d":"12.3"}]
[null,460,{"$f":"VLOOKUP(B63,AGS_Namen!$C$1:$D$58,2,FALSE)","v":"Vechta"},29.4,15.5,28.5,14.7,{"v":26.003744539213645,"d":"26.0"},{"v":16.392760557520283,"d":"16.4"},{"v":27.94486215538847,"d":"27.9"},{"v":19.387755102040817,"d":"19.4"},{"v":23.868035684228243,"d":"23.9"},{"v":23.682881669752568,"d":"23.7"},{"v":17.744181420330214,"d":"17.7"},{"v":11.995225780783768,"d":"12.0"},{"v":23.049972340033193,"d":"23.0"},{"v":14.973262032085561,"d":"15.0"}]
[null,461,{"$f":"VLOOKUP(B64,AGS_Namen!$C$1:$D$58,2,FALSE)","v":"Wesermarsch"},20.8,10.1,18.4,10.7,{"v":19.755170958210215,"d":"19.8"},{"v":12.283663993246096,"d":"12.3"},{"v":21.06777493606138,"d":"21.1"},{"v":12.787723785166241,"d":"12.8"},{"v":23.529411764705884,"d":"23.5"},{"v":16.476747767169694,"d":"16.5"},{"v":22.39367707941287,"d":"22.4"},{"v":14.188934888972526,"d":"14.2"},{"v":22.89701999245568,"d":"22.9"},{"v":15.390418709920784,"d":"15.4"}]
[null,462,{"$f":"VLOOKUP(B65,AGS_Namen!$C$1:$D$58,2,FALSE)","v":"Wittmund"},10.6,2.5,11.7,{"v":7,"d":"7.0"},{"v":11.756664388243337,"d":"11.8"},{"v":7.177033492822966,"d":"7.2"},{"v":12.492269635126778,"d":"12.5"},{"v":7.359307359307359,"d":"7.4"},{"v":13.21937321937322,"d":"13.2"},{"v":8.262108262108262,"d":"8.3"},{"v":9.352517985611511,"d":"9.4"},{"v":5.101373446697187,"d":"5.1"},{"v":9.35483870967742,"d":"9.4"},{"v":4.709677419354839,"d":"4.7"}]
[null,4,{"$f":"VLOOKUP(B66,AGS_Namen!$C$1:$D$58,2,FALSE)","v":"Stat. Region Weser-Ems"},21.2,11.2,19.9,11.7,{"v":19.4612363150124,"d":"19.5"},{"v":11.599855141098143,"d":"11.6"},{"v":21.573650294874422,"d":"21.6"},{"v":13.689459662545255,"d":"13.7"},{"v":22.66366133073649,"d":"22.7"},{"v":15.36332104209294,"d":"15.4"},{"v":21.34006189247146,"d":"21.3"},{"v":13.306881364202525,"d":"13.3"},{"v":22.202736748505654,"d":"22.2"},{"v":14.400039519834015,"d":"14.4"}]
[null,null,{"$f":"VLOOKUP(B67,AGS_Namen!$C$1:$D$58,2,FALSE)","v":"Niedersachsen"},22.2,{"v":12,"d":"12.0"},{"v":22,"d":"22.0"},12.4,{"v":21.953047503582056,"d":"22.0"},{"v":12.651603659208641,"d":"12.7"},{"v":23.396600449980795,"d":"23.4"},{"v":14.091738462382704,"d":"14.1"},{"v":24.162548963535883,"d":"24.2"},{"v":15.584203980926667,"d":"15.6"},{"v":24.164028613048398,"d":"24.2"},{"v":14.616987166445586,"d":"14.6"},{"v":25.472519249325536,"d":"25.5"},{"v":16.193064335085957,"d":"16.2"}]
[]
[null,null,"Quelle: Kinder- und Jugendhilfestatistik"]
[]
[]
[null,null,"Karte B2-2: Anteil Kinder im Alter bis unter 6 Jahren mit Zuwanderungsgeschichte (in der Familie wird nicht vorrangig Deutsch gesprochen) an allen betreuten Kindern in Tageseinrichtungen am 01.03.2019 in Prozent"]
{"$rows_empty":40}
[null,null,{"$f":"Def","v":"Die Definition zu dem Indikator sowie methodische Hinweise finden Sie in der Tabelle Aktuelle Ergebnisse"}]
[null,null,"Link zur LSN-Online-Datenbank"]

{"sheet":"B3","index":18,"n_rows":115,"n_cols":13,"rows_kept":115,"merged":[[2,2,2,4],[4,2,4,12],[5,2,5,12],[8,1,10,1],[8,2,10,2],[8,3,10,3],[8,4,8,7],[8,8,10,8],[8,9,8,12],[9,4,10,4],[9,9,10,9],[10,5,10,6],[10,10,10,11],[67,2,67,10],[73,2,73,11],[114,2,114,10]]}
[null,null,{"$f":"Kopf","v":"Migration und Teilhabe in Niedersachsen - Integrationsmonitoring 2020 - Regionalinformationen "}]
[]
[]
[]
[null,null,"Indikator B3: Betreute Kinder bis unter 3 Jahren und von 3 bis unter 6 Jahren mit Zuwanderungsgeschichte in Kindertagesbetreuung"]
[null,null,"Tabelle B3-2: Betreute Kinder bis unter 3 Jahren und von 3 bis unter 6 Jahren mit Zuwanderungsgeschichte in Kindertagesbetreuung \nam 01. März 20191) nach Kreisen"]
[]
[]
[null,"AGS","Kreisfreie Stadt\nLandkreis\n(Großstadt, Umland)\nStatistische Region\nLand","Kinder im Alter von \nunter 3 Jahren","Kinder im Alter von unter 3 Jahren mit ausländischer Herkunft mindestens eines Elternteils",{"$nulls":3},"Kinder im Alter von 3 bis unter 6 Jahren","Kinder im Alter von 3 bis unter 6 Jahren mit ausländischer Herkunft mindestens eines Elternteils"]
[{"$nulls":4},"Anzahl","Anteil an allen betreuten Kindern","Anteil an allen betreuten Kindern im Vorjahr","Veränderung des Anteils gegenüber dem Vorjahr",null,"Anzahl","Anteil an allen betreuten Kindern","Anteil an allen betreuten Kindern im Vorjahr","Veränderung des Anteils gegenüber dem Vorjahr"]
[{"$nulls":5},"Prozent",null,"Prozentpunkte",null,null,"Prozent",null,"Prozentpunkte"]
[null,"1","2","3","4","5","6","7","8","9","10","11","12"]
[null,{"v":101,"d":"101.0"},{"$f":"VLOOKUP(Tabelle18[[#This Row],[1]],AGS_Namen!$C$1:$D$58,2,FALSE)","v":"Braunschweig, Stadt"},{"v":2562,"d":" 2 562"},{"v":644,"d":"  644"},{"v":25.136612021857925,"d":"25.1"},{"v":22.60111022997621,"d":"22.6"},{"v":2.535501791881714,"d":"2.5"},{"v":5852,"d":" 5 852"},{"v":2216,"d":" 2 216"},{"v":37.8673957621326,"d":"37.9"},{"v":35.798611111111114,"d":"35.8"},{"v":2.0687846510214882,"d":"2.1"}]
[null,{"v":102,"d":"102.0"},{"$f":"VLOOKUP(Tabelle18[[#This Row],[1]],AGS_Namen!$C$1:$D$58,2,FALSE)","v":"Salzgitter, Stadt"},{"v":603,"d":"  603"},{"v":159,"d":"  159"},{"v":26.368159203980102,"d":"26.4"},{"v":25.734024179620036,"d":"25.7"},{"v":0.6341350243600665,"d":"0.6"},{"v":2663,"d":" 2 663"},{"v":1236,"d":" 1 236"},{"v":46.41381900112655,"d":"46.4"},{"v":45.352873119938295,"d":"45.4"},{"v":1.0609458811882533,"d":"1.1"}]
[null,{"v":103,"d":"103.0"},{"$f":"VLOOKUP(Tabelle18[[#This Row],[1]],AGS_Namen!$C$1:$D$58,2,FALSE)","v":"Wolfsburg, Stadt"},{"v":1480,"d":" 1 480"},{"v":460,"d":"  460"},{"v":31.08108108108108,"d":"31.1"},{"v":24.75177304964539,"d":"24.8"},{"v":6.329308031435691,"d":"6.3"},{"v":3443,"d":" 3 443"},{"v":1485,"d":" 1 485"},{"v":43.13099041533546,"d":"43.1"},{"v":32.65785609397944,"d":"32.7"},{"v":10.47313432135602,"d":"10.5"}]
[null,{"v":151,"d":"151.0"},{"$f":"VLOOKUP(Tabelle18[[#This Row],[1]],AGS_Namen!$C$1:$D$58,2,FALSE)","v":"Gifhorn"},{"v":1727,"d":" 1 727"},{"v":187,"d":"  187"},{"v":10.828025477707007,"d":"10.8"},{"v":10.542540073982737,"d":"10.5"},{"v":0.28548540372426956,"d":"0.3"},{"v":4656,"d":" 4 656"},{"v":915,"d":"  915"},{"v":19.6520618556701,"d":"19.7"},{"v":15.703602991162475,"d":"15.7"},{"v":3.948458864507627,"d":"3.9"}]
[null,{"v":153,"d":"153.0"},{"$f":"VLOOKUP(Tabelle18[[#This Row],[1]],AGS_Namen!$C$1:$D$58,2,FALSE)","v":"Goslar"},{"v":1025,"d":" 1 025"},{"v":112,"d":"  112"},{"v":10.926829268292684,"d":"10.9"},{"v":12.068965517241379,"d":"12.1"},{"v":-1.1421362489486953,"d":"-1.1"},{"v":2727,"d":" 2 727"},{"v":646,"d":"  646"},{"v":23.689035570223687,"d":"23.7"},{"v":22.09737827715356,"d":"22.1"},{"v":1.5916572930701278,"d":"1.6"}]
[null,{"v":154,"d":"154.0"},{"$f":"VLOOKUP(Tabelle18[[#This Row],[1]],AGS_Namen!$C$1:$D$58,2,FALSE)","v":"Helmstedt"},{"v":818,"d":"  818"},{"v":67,"d":"  67"},{"v":8.190709046454767,"d":"8.2"},{"v":8.422459893048128,"d":"8.4"},{"v":-0.23175084659336065,"d":"-0.2"},{"v":2101,"d":" 2 101"},{"v":304,"d":"  304"},{"v":14.469300333174678,"d":"14.5"},{"v":15.714982918496828,"d":"15.7"},{"v":-1.2456825853221503,"d":"-1.2"}]
[null,{"v":155,"d":"155.0"},{"$f":"VLOOKUP(Tabelle18[[#This Row],[1]],AGS_Namen!$C$1:$D$58,2,FALSE)","v":"Northeim"},{"v":950,"d":"  950"},{"v":165,"d":"  165"},{"v":17.36842105263158,"d":"17.4"},{"v":15.193965517241379,"d":"15.2"},{"v":2.1744555353901998,"d":"2.2"},{"v":3010,"d":" 3 010"},{"v":704,"d":"  704"},{"v":23.388704318936878,"d":"23.4"},{"v":22.551632245169888,"d":"22.6"},{"v":0.8370720737669899,"d":"0.8"}]
[null,{"v":157,"d":"157.0"},{"$f":"VLOOKUP(Tabelle18[[#This Row],[1]],AGS_Namen!$C$1:$D$58,2,FALSE)","v":"Peine"},{"v":1236,"d":" 1 236"},{"v":169,"d":"  169"},{"v":13.673139158576053,"d":"13.7"},{"v":11.90909090909091,"d":"11.9"},{"v":1.7640482494851426,"d":"1.8"},{"v":3518,"d":" 3 518"},{"v":933,"d":"  933"},{"v":26.520750426378626,"d":"26.5"},{"v":26.140958983246676,"d":"26.1"},{"v":0.3797914431319498,"d":"0.4"}]
[null,{"v":158,"d":"158.0"},{"$f":"VLOOKUP(Tabelle18[[#This Row],[1]],AGS_Namen!$C$1:$D$58,2,FALSE)","v":"Wolfenbüttel"},{"v":1021,"d":" 1 021"},{"v":129,"d":"  129"},{"v":12.634671890303622,"d":"12.6"},{"v":10.059171597633137,"d":"10.1"},{"v":2.575500292670485,"d":"2.6"},{"v":2879,"d":" 2 879"},{"v":589,"d":"  589"},{"v":20.45849253212921,"d":"20.5"},{"v":19.818511796733212,"d":"19.8"},{"v":0.6399807353959979,"d":"0.6"}]
[null,{"v":159,"d":"159.0"},{"$f":"VLOOKUP(Tabelle18[[#This Row],[1]],AGS_Namen!$C$1:$D$58,2,FALSE)","v":"Göttingen"},{"v":3176,"d":" 3 176"},{"v":615,"d":"  615"},{"v":19.3639798488665,"d":"19.4"},{"v":17.035830618892508,"d":"17.0"},{"v":2.3281492299739917,"d":"2.3"},{"v":7291,"d":" 7 291"},{"v":2000,"d":" 2 000"},{"v":27.431079412974903,"d":"27.4"},{"v":26.463995516951528,"d":"26.5"},{"v":0.9670838960233752,"d":"1.0"}]
[null,{"v":159016,"d":"159016.0"},{"$f":"VLOOKUP(Tabelle18[[#This Row],[1]],AGS_Namen!$C$1:$D$58,2,FALSE)","v":"   dav. Göttingen, Stadt"},{"v":1372,"d":" 1 372"},{"v":437,"d":"  437"},{"v":31.851311953352766,"d":"31.9"},{"v":27.232796486090777,"d":"27.2"},{"v":4.6185154672619895,"d":"4.6"},{"v":2684,"d":" 2 684"},{"v":1102,"d":" 1 102"},{"v":41.05812220566319,"d":"41.1"},{"v":39.33809702895826,"d":"39.3"},{"v":1.7200251767049295,"d":"1.7"}]
[null,{"v":159999,"d":"159999.0"},{"$f":"VLOOKUP(Tabelle18[[#This Row],[1]],AGS_Namen!$C$1:$D$58,2,FALSE)","v":"   dav. Göttingen, Umland"},{"v":1804,"d":" 1 804"},{"v":178,"d":"  178"},{"v":9.866962305986696,"d":"9.9"},{"v":8.86150234741784,"d":"8.9"},{"v":1.0054599585688564,"d":"1.0"},{"v":4607,"d":" 4 607"},{"v":898,"d":"  898"},{"v":19.492077273713914,"d":"19.5"},{"v":18.821165438714,"d":"18.8"},{"v":0.670911834999913,"d":"0.7"}]
[null,{"v":1,"d":"1.0"},{"$f":"VLOOKUP(Tabelle18[[#This Row],[1]],AGS_Namen!$C$1:$D$58,2,FALSE)","v":"Stat. Region Braunschweig"},{"v":14598,"d":" 14 598"},{"v":2707,"d":" 2 707"},{"v":18.543636114536238,"d":"18.5"},{"v":16.582015880964303,"d":"16.6"},{"v":1.961620233571935,"d":"2.0"},{"v":38140,"d":" 38 140"},{"v":11028,"d":" 11 028"},{"v":28.914525432616678,"d":"28.9"},{"v":26.772625983300667,"d":"26.8"},{"v":2.1418994493160106,"d":"2.1"}]
[null,{"v":241,"d":"241.0"},{"$f":"VLOOKUP(Tabelle18[[#This Row],[1]],AGS_Namen!$C$1:$D$58,2,FALSE)","v":"Hannover, Region"},{"v":11283,"d":" 11 283"},{"v":3091,"d":" 3 091"},{"v":27.395196313037314,"d":"27.4"},{"v":26.88471560787133,"d":"26.9"},{"v":0.5104807051659854,"d":"0.5"},{"v":29733,"d":" 29 733"},{"v":12213,"d":" 12 213"},{"v":41.07557259610534,"d":"41.1"},{"v":39.37279846790465,"d":"39.4"},{"v":1.7027741282006872,"d":"1.7"}]
[null,{"v":241001,"d":"241001.0"},{"$f":"VLOOKUP(Tabelle18[[#This Row],[1]],AGS_Namen!$C$1:$D$58,2,FALSE)","v":"   dav. Hannover, Lhst."},{"v":5562,"d":" 5 562"},{"v":1986,"d":" 1 986"},{"v":35.706580366774546,"d":"35.7"},{"v":35.556750941366325,"d":"35.6"},{"v":0.14982942540822108,"d":"0.1"},{"v":13544,"d":" 13 544"},{"v":6963,"d":" 6 963"},{"v":51.41021854695806,"d":"51.4"},{"v":51.066993828537434,"d":"51.1"},{"v":0.34322471842062896,"d":"0.3"}]
[null,{"v":241999,"d":"241999.0"},{"$f":"VLOOKUP(Tabelle18[[#This Row],[1]],AGS_Namen!$C$1:$D$58,2,FALSE)","v":"   dav. Hannover, Umland"},{"v":5721,"d":" 5 721"},{"v":1105,"d":" 1 105"},{"v":19.314805104002797,"d":"19.3"},{"v":18.17363112391931,"d":"18.2"},{"v":1.1411739800834866,"d":"1.1"},{"v":16189,"d":" 16 189"},{"v":5250,"d":" 5 250"},{"v":32.42942738896782,"d":"32.4"},{"v":29.41362715298885,"d":"29.4"},{"v":3.015800235978965,"d":"3.0"}]
[null,{"v":251,"d":"251.0"},{"$f":"VLOOKUP(Tabelle18[[#This Row],[1]],AGS_Namen!$C$1:$D$58,2,FALSE)","v":"Diepholz"},{"v":2040,"d":" 2 040"},{"v":319,"d":"  319"},{"v":15.637254901960784,"d":"15.6"},{"v":14.167127836192584,"d":"14.2"},{"v":1.4701270657681995,"d":"1.5"},{"v":5389,"d":" 5 389"},{"v":1329,"d":" 1 329"},{"v":24.66134718871776,"d":"24.7"},{"v":22.580019398642097,"d":"22.6"},{"v":2.0813277900756617,"d":"2.1"}]
[null,{"v":252,"d":"252.0"},{"$f":"VLOOKUP(Tabelle18[[#This Row],[1]],AGS_Namen!$C$1:$D$58,2,FALSE)","v":"Hameln-Pyrmont"},{"v":1187,"d":" 1 187"},{"v":261,"d":"  261"},{"v":21.988205560235887,"d":"22.0"},{"v":18.01801801801802,"d":"18.0"},{"v":3.970187542217868,"d":"4.0"},{"v":3553,"d":" 3 553"},{"v":1152,"d":" 1 152"},{"v":32.423304249929636,"d":"32.4"},{"v":30.80568720379147,"d":"30.8"},{"v":1.6176170461381645,"d":"1.6"}]
[null,{"v":254,"d":"254.0"},{"$f":"VLOOKUP(Tabelle18[[#This Row],[1]],AGS_Namen!$C$1:$D$58,2,FALSE)","v":"Hildesheim"},{"v":2111,"d":" 2 111"},{"v":437,"d":"  437"},{"v":20.70108953102795,"d":"20.7"},{"v":15.39951573849879,"d":"15.4"},{"v":5.30157379252916,"d":"5.3"},{"v":6475,"d":" 6 475"},{"v":1832,"d":" 1 832"},{"v":28.29343629343629,"d":"28.3"},{"v":26.635959339263028,"d":"26.6"},{"v":1.6574769541732621,"d":"1.7"}]
[null,{"v":255,"d":"255.0"},{"$f":"VLOOKUP(Tabelle18[[#This Row],[1]],AGS_Namen!$C$1:$D$58,2,FALSE)","v":"Holzminden"},{"v":513,"d":"  513"},{"v":91,"d":"  91"},{"v":17.73879142300195,"d":"17.7"},{"v":14.767932489451477,"d":"14.8"},{"v":2.9708589335504723,"d":"3.0"},{"v":1581,"d":" 1 581"},{"v":401,"d":"  401"},{"v":25.363693864642634,"d":"25.4"},{"v":19.022103148024115,"d":"19.0"},{"v":6.341590716618519,"d":"6.3"}]
[null,{"v":256,"d":"256.0"},{"$f":"VLOOKUP(Tabelle18[[#This Row],[1]],AGS_Namen!$C$1:$D$58,2,FALSE)","v":"Nienburg (Weser)"},{"v":1009,"d":" 1 009"},{"v":143,"d":"  143"},{"v":14.172447968285432,"d":"14.2"},{"v":13.146997929606624,"d":"13.1"},{"v":1.0254500386788088,"d":"1.0"},{"v":3094,"d":" 3 094"},{"v":668,"d":"  668"},{"v":21.590174531351003,"d":"21.6"},{"v":21.092150170648463,"d":"21.1"},{"v":0.49802436070254075,"d":"0.5"}]
[null,{"v":257,"d":"257.0"},{"$f":"VLOOKUP(Tabelle18[[#This Row],[1]],AGS_Namen!$C$1:$D$58,2,FALSE)","v":"Schaumburg"},{"v":1311,"d":" 1 311"},{"v":228,"d":"  228"},{"v":17.391304347826086,"d":"17.4"},{"v":14.970563498738434,"d":"15.0"},{"v":2.420740849087652,"d":"2.4"},{"v":3677,"d":" 3 677"},{"v":1115,"d":" 1 115"},{"v":30.32363339679086,"d":"30.3"},{"v":27.095130237825593,"d":"27.1"},{"v":3.2285031589652675,"d":"3.2"}]
[null,{"v":2,"d":"2.0"},{"$f":"VLOOKUP(Tabelle18[[#This Row],[1]],AGS_Namen!$C$1:$D$58,2,FALSE)","v":"Stat. Region Hannover"},{"v":19454,"d":" 19 454"},{"v":4570,"d":" 4 570"},{"v":23.491312840546932,"d":"23.5"},{"v":22.09711846318036,"d":"22.1"},{"v":1.3941943773665706,"d":"1.4"},{"v":53502,"d":" 53 502"},{"v":18710,"d":" 18 710"},{"v":34.97065530260551,"d":"35.0"},{"v":33.16417738308056,"d":"33.2"},{"v":1.8064779195249443,"d":"1.8"}]
[null,{"v":351,"d":"351.0"},{"$f":"VLOOKUP(Tabelle18[[#This Row],[1]],AGS_Namen!$C$1:$D$58,2,FALSE)","v":"Celle"},{"v":1518,"d":" 1 518"},{"v":167,"d":"  167"},{"v":11.001317523056652,"d":"11.0"},{"v":9.479305740987984,"d":"9.5"},{"v":1.5220117820686685,"d":"1.5"},{"v":4676,"d":" 4 676"},{"v":1025,"d":" 1 025"},{"v":21.92044482463644,"d":"21.9"},{"v":20.63632346442775,"d":"20.6"},{"v":1.2841213602086903,"d":"1.3"}]
[null,{"v":352,"d":"352.0"},{"$f":"VLOOKUP(Tabelle18[[#This Row],[1]],AGS_Namen!$C$1:$D$58,2,FALSE)","v":"Cuxhaven"},{"v":1705,"d":" 1 705"},{"v":217,"d":"  217"},{"v":12.727272727272727,"d":"12.7"},{"v":12.08515967438948,"d":"12.1"},{"v":0.6421130528832464,"d":"0.6"},{"v":4776,"d":" 4 776"},{"v":819,"d":"  819"},{"v":17.14824120603015,"d":"17.1"},{"v":17.693288020390824,"d":"17.7"},{"v":-0.5450468143606741,"d":"-0.5"}]
[null,{"v":353,"d":"353.0"},{"$f":"VLOOKUP(Tabelle18[[#This Row],[1]],AGS_Namen!$C$1:$D$58,2,FALSE)","v":"Harburg"},{"v":2631,"d":" 2 631"},{"v":368,"d":"  368"},{"v":13.987077156974534,"d":"14.0"},{"v":12.580645161290322,"d":"12.6"},{"v":1.406431995684212,"d":"1.4"},{"v":6948,"d":" 6 948"},{"v":1545,"d":" 1 545"},{"v":22.236614853195164,"d":"22.2"},{"v":22.403888643393724,"d":"22.4"},{"v":-0.1672737901985606,"d":"-0.2"}]
[null,{"v":354,"d":"354.0"},{"$f":"VLOOKUP(Tabelle18[[#This Row],[1]],AGS_Namen!$C$1:$D$58,2,FALSE)","v":"Lüchow-Dannenberg"},{"v":338,"d":"  338"},{"v":25,"d":"  25"},{"v":7.396449704142012,"d":"7.4"},{"v":15.193370165745856,"d":"15.2"},{"v":-7.796920461603844,"d":"-7.8"},{"v":1103,"d":" 1 103"},{"v":158,"d":"  158"},{"v":14.324569356300998,"d":"14.3"},{"v":15.5893536121673,"d":"15.6"},{"v":-1.264784255866303,"d":"-1.3"}]
[null,{"v":355,"d":"355.0"},{"$f":"VLOOKUP(Tabelle18[[#This Row],[1]],AGS_Namen!$C$1:$D$58,2,FALSE)","v":"Lüneburg"},{"v":2056,"d":" 2 056"},{"v":319,"d":"  319"},{"v":15.51556420233463,"d":"15.5"},{"v":11.727416798732172,"d":"11.7"},{"v":3.7881474036024585,"d":"3.8"},{"v":4962,"d":" 4 962"},{"v":1072,"d":" 1 072"},{"v":21.604191858121723,"d":"21.6"},{"v":22.134146341463413,"d":"22.1"},{"v":-0.5299544833416903,"d":"-0.5"}]
[null,{"v":356,"d":"356.0"},{"$f":"VLOOKUP(Tabelle18[[#This Row],[1]],AGS_Namen!$C$1:$D$58,2,FALSE)","v":"Osterholz"},{"v":1063,"d":" 1 063"},{"v":131,"d":"  131"},{"v":12.323612417685794,"d":"12.3"},{"v":11.561866125760648,"d":"11.6"},{"v":0.7617462919251459,"d":"0.8"},{"v":2884,"d":" 2 884"},{"v":621,"d":"  621"},{"v":21.53259361997226,"d":"21.5"},{"v":18.39773130095711,"d":"18.4"},{"v":3.134862319015152,"d":"3.1"}]
[null,{"v":357,"d":"357.0"},{"$f":"VLOOKUP(Tabelle18[[#This Row],[1]],AGS_Namen!$C$1:$D$58,2,FALSE)","v":"Rotenburg (Wümme)"},{"v":1316,"d":" 1 316"},{"v":161,"d":"  161"},{"v":12.23404255319149,"d":"12.2"},{"v":11.5990057995029,"d":"11.6"},{"v":0.6350367536885901,"d":"0.6"},{"v":4003,"d":" 4 003"},{"v":775,"d":"  775"},{"v":19.360479640269798,"d":"19.4"},{"v":18.247609201344016,"d":"18.2"},{"v":1.112870438925782,"d":"1.1"}]
[null,{"v":358,"d":"358.0"},{"$f":"VLOOKUP(Tabelle18[[#This Row],[1]],AGS_Namen!$C$1:$D$58,2,FALSE)","v":"Heidekreis"},{"v":1094,"d":" 1 094"},{"v":185,"d":"  185"},{"v":16.910420475319928,"d":"16.9"},{"v":13.479052823315119,"d":"13.5"},{"v":3.431367652004809,"d":"3.4"},{"v":3484,"d":" 3 484"},{"v":747,"d":"  747"},{"v":21.440872560275544,"d":"21.4"},{"v":19.79815969130306,"d":"19.8"},{"v":1.6427128689724846,"d":"1.6"}]
[null,{"v":359,"d":"359.0"},{"$f":"VLOOKUP(Tabelle18[[#This Row],[1]],AGS_Namen!$C$1:$D$58,2,FALSE)","v":"Stade"},{"v":1905,"d":" 1 905"},{"v":236,"d":"  236"},{"v":12.388451443569554,"d":"12.4"},{"v":10.096426545660805,"d":"10.1"},{"v":2.2920248979087496,"d":"2.3"},{"v":5264,"d":" 5 264"},{"v":1063,"d":" 1 063"},{"v":20.193768996960486,"d":"20.2"},{"v":19.752099160335863,"d":"19.8"},{"v":0.441669836624623,"d":"0.4"}]
[null,{"v":360,"d":"360.0"},{"$f":"VLOOKUP(Tabelle18[[#This Row],[1]],AGS_Namen!$C$1:$D$58,2,FALSE)","v":"Uelzen"},{"v":715,"d":"  715"},{"v":81,"d":"  81"},{"v":11.328671328671328,"d":"11.3"},{"v":10.340136054421768,"d":"10.3"},{"v":0.9885352742495606,"d":"1.0"},{"v":2069,"d":" 2 069"},{"v":432,"d":"  432"},{"v":20.879652005799905,"d":"20.9"},{"v":19.084712755598833,"d":"19.1"},{"v":1.7949392502010717,"d":"1.8"}]
[null,{"v":361,"d":"361.0"},{"$f":"VLOOKUP(Tabelle18[[#This Row],[1]],AGS_Namen!$C$1:$D$58,2,FALSE)","v":"Verden"},{"v":1290,"d":" 1 290"},{"v":246,"d":"  246"},{"v":19.069767441860467,"d":"19.1"},{"v":16.429699842022117,"d":"16.4"},{"v":2.64006759983835,"d":"2.6"},{"v":3669,"d":" 3 669"},{"v":908,"d":"  908"},{"v":24.747887707822294,"d":"24.7"},{"v":24.30536065113668,"d":"24.3"},{"v":0.44252705668561276,"d":"0.4"}]
[null,{"v":3,"d":"3.0"},{"$f":"VLOOKUP(Tabelle18[[#This Row],[1]],AGS_Namen!$C$1:$D$58,2,FALSE)","v":"Stat. Region Lüneburg"},{"v":15631,"d":" 15 631"},{"v":2136,"d":" 2 136"},{"v":13.665152581408737,"d":"13.7"},{"v":12.012092710782667,"d":"12.0"},{"v":1.6530598706260697,"d":"1.7"},{"v":43838,"d":" 43 838"},{"v":9165,"d":" 9 165"},{"v":20.90651945800447,"d":"20.9"},{"v":20.338387270639515,"d":"20.3"},{"v":0.5681321873649559,"d":"0.6"}]
[null,{"v":401,"d":"401.0"},{"$f":"VLOOKUP(Tabelle18[[#This Row],[1]],AGS_Namen!$C$1:$D$58,2,FALSE)","v":"Delmenhorst, Stadt"},{"v":484,"d":"  484"},{"v":146,"d":"  146"},{"v":30.165289256198346,"d":"30.2"},{"v":22.302158273381295,"d":"22.3"},{"v":7.863130982817051,"d":"7.9"},{"v":1783,"d":" 1 783"},{"v":820,"d":"  820"},{"v":45.98990465507571,"d":"46.0"},{"v":46.005830903790084,"d":"46.0"},{"v":-0.015926248714372093,"d":"-0.0"}]
[null,{"v":402,"d":"402.0"},{"$f":"VLOOKUP(Tabelle18[[#This Row],[1]],AGS_Namen!$C$1:$D$58,2,FALSE)","v":"Emden, Stadt"},{"v":358,"d":"  358"},{"v":66,"d":"  66"},{"v":18.435754189944134,"d":"18.4"},{"v":18.13031161473088,"d":"18.1"},{"v":0.3054425752132559,"d":"0.3"},{"v":1193,"d":" 1 193"},{"v":351,"d":"  351"},{"v":29.42162615255658,"d":"29.4"},{"v":26.311336717428084,"d":"26.3"},{"v":3.1102894351284966,"d":"3.1"}]
[null,{"v":403,"d":"403.0"},{"$f":"VLOOKUP(Tabelle18[[#This Row],[1]],AGS_Namen!$C$1:$D$58,2,FALSE)","v":"Oldenburg (Oldb), Stadt"},{"v":1827,"d":" 1 827"},{"v":393,"d":"  393"},{"v":21.510673234811165,"d":"21.5"},{"v":19.52191235059761,"d":"19.5"},{"v":1.988760884213555,"d":"2.0"},{"v":4124,"d":" 4 124"},{"v":1221,"d":" 1 221"},{"v":29.607177497575172,"d":"29.6"},{"v":29.79859257461781,"d":"29.8"},{"v":-0.19141507704263816,"d":"-0.2"}]
[null,{"v":404,"d":"404.0"},{"$f":"VLOOKUP(Tabelle18[[#This Row],[1]],AGS_Namen!$C$1:$D$58,2,FALSE)","v":"Osnabrück, Stadt"},{"v":1444,"d":" 1 444"},{"v":306,"d":"  306"},{"v":21.191135734072024,"d":"21.2"},{"v":23.28767123287671,"d":"23.3"},{"v":-2.0965354988046876,"d":"-2.1"},{"v":3907,"d":" 3 907"},{"v":1548,"d":" 1 548"},{"v":39.621192730995645,"d":"39.6"},{"v":40.48551292090838,"d":"40.5"},{"v":-0.864320189912732,"d":"-0.9"}]
[null,{"v":405,"d":"405.0"},{"$f":"VLOOKUP(Tabelle18[[#This Row],[1]],AGS_Namen!$C$1:$D$58,2,FALSE)","v":"Wilhelmshaven, Stadt"},{"v":436,"d":"  436"},{"v":52,"d":"  52"},{"v":11.926605504587156,"d":"11.9"},{"v":10.677083333333332,"d":"10.7"},{"v":1.2495221712538243,"d":"1.2"},{"v":1536,"d":" 1 536"},{"v":437,"d":"  437"},{"v":28.450520833333332,"d":"28.5"},{"v":28.391793514228986,"d":"28.4"},{"v":0.05872731910434581,"d":"0.1"}]
[null,{"v":451,"d":"451.0"},{"$f":"VLOOKUP(Tabelle18[[#This Row],[1]],AGS_Namen!$C$1:$D$58,2,FALSE)","v":"Ammerland"},{"v":1142,"d":" 1 142"},{"v":107,"d":"  107"},{"v":9.369527145359019,"d":"9.4"},{"v":6.1010486177311725,"d":"6.1"},{"v":3.2684785276278463,"d":"3.3"},{"v":3181,"d":" 3 181"},{"v":613,"d":"  613"},{"v":19.27066960075448,"d":"19.3"},{"v":18.50467289719626,"d":"18.5"},{"v":0.7659967035582191,"d":"0.8"}]
[null,{"v":452,"d":"452.0"},{"$f":"VLOOKUP(Tabelle18[[#This Row],[1]],AGS_Namen!$C$1:$D$58,2,FALSE)","v":"Aurich"},{"v":1319,"d":" 1 319"},{"v":140,"d":"  140"},{"v":10.614101592115238,"d":"10.6"},{"v":11.874469889737066,"d":"11.9"},{"v":-1.2603682976218273,"d":"-1.3"},{"v":4564,"d":" 4 564"},{"v":661,"d":"  661"},{"v":14.482909728308503,"d":"14.5"},{"v":15.065700045310376,"d":"15.1"},{"v":-0.5827903170018729,"d":"-0.6"}]
[null,{"v":453,"d":"453.0"},{"$f":"VLOOKUP(Tabelle18[[#This Row],[1]],AGS_Namen!$C$1:$D$58,2,FALSE)","v":"Cloppenburg"},{"v":1631,"d":" 1 631"},{"v":297,"d":"  297"},{"v":18.209687308399754,"d":"18.2"},{"v":16.31016042780749,"d":"16.3"},{"v":1.8995268805922656,"d":"1.9"},{"v":4827,"d":" 4 827"},{"v":1083,"d":" 1 083"},{"v":22.436295835922934,"d":"22.4"},{"v":22.804347826086957,"d":"22.8"},{"v":-0.3680519901640231,"d":"-0.4"}]
[null,{"v":454,"d":"454.0"},{"$f":"VLOOKUP(Tabelle18[[#This Row],[1]],AGS_Namen!$C$1:$D$58,2,FALSE)","v":"Emsland"},{"v":3045,"d":" 3 045"},{"v":541,"d":"  541"},{"v":17.766830870279147,"d":"17.8"},{"v":15.789473684210526,"d":"15.8"},{"v":1.9773571860686214,"d":"2.0"},{"v":8944,"d":" 8 944"},{"v":2049,"d":" 2 049"},{"v":22.909212880143112,"d":"22.9"},{"v":21.388019928165914,"d":"21.4"},{"v":1.5211929519771985,"d":"1.5"}]
[null,{"v":455,"d":"455.0"},{"$f":"VLOOKUP(Tabelle18[[#This Row],[1]],AGS_Namen!$C$1:$D$58,2,FALSE)","v":"Friesland"},{"v":801,"d":"  801"},{"v":54,"d":"  54"},{"v":6.741573033707865,"d":"6.7"},{"v":6.25,"d":"6.3"},{"v":0.49157303370786476,"d":"0.5"},{"v":2385,"d":" 2 385"},{"v":257,"d":"  257"},{"v":10.775681341719077,"d":"10.8"},{"v":11.164835164835164,"d":"11.2"},{"v":-0.3891538231160876,"d":"-0.4"}]
[null,{"v":456,"d":"456.0"},{"$f":"VLOOKUP(Tabelle18[[#This Row],[1]],AGS_Namen!$C$1:$D$58,2,FALSE)","v":"Grafschaft Bentheim"},{"v":1304,"d":" 1 304"},{"v":264,"d":"  264"},{"v":20.245398773006134,"d":"20.2"},{"v":21.386800334168754,"d":"21.4"},{"v":-1.1414015611626205,"d":"-1.1"},{"v":3726,"d":" 3 726"},{"v":1118,"d":" 1 118"},{"v":30.00536768652711,"d":"30.0"},{"v":30.997229916897506,"d":"31.0"},{"v":-0.9918622303703977,"d":"-1.0"}]
[null,{"v":457,"d":"457.0"},{"$f":"VLOOKUP(Tabelle18[[#This Row],[1]],AGS_Namen!$C$1:$D$58,2,FALSE)","v":"Leer"},{"v":1277,"d":" 1 277"},{"v":183,"d":"  183"},{"v":14.330462020360219,"d":"14.3"},{"v":11.634615384615385,"d":"11.6"},{"v":2.695846635744834,"d":"2.7"},{"v":4281,"d":" 4 281"},{"v":706,"d":"  706"},{"v":16.491473954683485,"d":"16.5"},{"v":14.860388073828679,"d":"14.9"},{"v":1.6310858808548065,"d":"1.6"}]
[null,{"v":458,"d":"458.0"},{"$f":"VLOOKUP(Tabelle18[[#This Row],[1]],AGS_Namen!$C$1:$D$58,2,FALSE)","v":"Oldenburg"},{"v":1195,"d":" 1 195"},{"v":100,"d":"  100"},{"v":8.368200836820083,"d":"8.4"},{"v":8.07899461400359,"d":"8.1"},{"v":0.28920622281649244,"d":"0.3"},{"v":3268,"d":" 3 268"},{"v":520,"d":"  520"},{"v":15.911872705018359,"d":"15.9"},{"v":15.129728040012505,"d":"15.1"},{"v":0.7821446650058537,"d":"0.8"}]
[null,{"v":459,"d":"459.0"},{"$f":"VLOOKUP(Tabelle18[[#This Row],[1]],AGS_Namen!$C$1:$D$58,2,FALSE)","v":"Osnabrück"},{"v":3329,"d":" 3 329"},{"v":492,"d":"  492"},{"v":14.779212976869932,"d":"14.8"},{"v":13.249211356466878,"d":"13.2"},{"v":1.5300016204030538,"d":"1.5"},{"v":9429,"d":" 9 429"},{"v":2022,"d":" 2 022"},{"v":21.444479796372892,"d":"21.4"},{"v":19.662861410434225,"d":"19.7"},{"v":1.7816183859386676,"d":"1.8"}]
[null,{"v":460,"d":"460.0"},{"$f":"VLOOKUP(Tabelle18[[#This Row],[1]],AGS_Namen!$C$1:$D$58,2,FALSE)","v":"Vechta"},{"v":1679,"d":" 1 679"},{"v":289,"d":"  289"},{"v":17.212626563430614,"d":"17.2"},{"v":15.218855218855218,"d":"15.2"},{"v":1.9937713445753964,"d":"2.0"},{"v":4358,"d":" 4 358"},{"v":1066,"d":" 1 066"},{"v":24.460761817347407,"d":"24.5"},{"v":18.501454898157128,"d":"18.5"},{"v":5.959306919190279,"d":"6.0"}]
[null,{"v":461,"d":"461.0"},{"$f":"VLOOKUP(Tabelle18[[#This Row],[1]],AGS_Namen!$C$1:$D$58,2,FALSE)","v":"Wesermarsch"},{"v":715,"d":"  715"},{"v":98,"d":"  98"},{"v":13.706293706293707,"d":"13.7"},{"v":16.715542521994134,"d":"16.7"},{"v":-3.0092488157004276,"d":"-3.0"},{"v":2105,"d":" 2 105"},{"v":522,"d":"  522"},{"v":24.798099762470308,"d":"24.8"},{"v":23.055162659123056,"d":"23.1"},{"v":1.742937103347252,"d":"1.7"}]
[null,{"v":462,"d":"462.0"},{"$f":"VLOOKUP(Tabelle18[[#This Row],[1]],AGS_Namen!$C$1:$D$58,2,FALSE)","v":"Wittmund"},{"v":342,"d":"  342"},{"v":21,"d":"  21"},{"v":6.140350877192982,"d":"6.1"},{"v":4.777070063694268,"d":"4.8"},{"v":1.3632808134987142,"d":"1.4"},{"v":1334,"d":" 1 334"},{"v":124,"d":"  124"},{"v":9.295352323838081,"d":"9.3"},{"v":9.704321455648218,"d":"9.7"},{"v":-0.40896913181013694,"d":"-0.4"}]
[null,{"v":4,"d":"4.0"},{"$f":"VLOOKUP(Tabelle18[[#This Row],[1]],AGS_Namen!$C$1:$D$58,2,FALSE)","v":"Stat. Region Weser-Ems"},{"v":22328,"d":" 22 328"},{"v":3549,"d":" 3 549"},{"v":15.89484055893945,"d":"15.9"},{"v":14.83083803227688,"d":"14.8"},{"v":1.06400252666257,"d":"1.1"},{"v":64945,"d":" 64 945"},{"v":15118,"d":" 15 118"},{"v":23.27815844175841,"d":"23.3"},{"v":22.328322460685136,"d":"22.3"},{"v":0.9498359810732744,"d":"0.9"}]
[null,{"v":0,"d":"0.0"},{"$f":"VLOOKUP(Tabelle18[[#This Row],[1]],AGS_Namen!$C$1:$D$58,2,FALSE)","v":"Niedersachsen"},{"v":72011,"d":" 72 011"},{"v":12962,"d":" 12 962"},{"v":18.000027773534597,"d":"18.0"},{"v":16.571814128138936,"d":"16.6"},{"v":1.4282136453956618,"d":"1.4"},{"v":200425,"d":" 200 425"},{"v":54021,"d":" 54 021"},{"v":26.953224398153925,"d":"27.0"},{"v":25.625751644021395,"d":"25.6"},{"v":1.327472754132529,"d":"1.3"}]
[]
[null,null,"1) Kinder in Kindertageseinrichtungen sowie Kinder in öffentlich geförderter Kindertagespflege, die nicht zusätzlich eine Einrichtung der Kindertagesbetreuung besuchen."]
[]
[null,null,"Quelle: Kinder- und Jugendhilfestatistik"]
[]
[]
[]
[null,null,"Karte B3-2: Anteil Kinder im Alter bis unter 3 Jahren mit Zuwanderungsgeschichte (mindestens ein Elternteil ausländischer Herkunft) an allen betreuten Kindern in Kindertagesbetreuung am 01.03.2019 in Prozent"]
{"$rows_empty":39}
[null,null,{"$f":"Def","v":"Die Definition zu dem Indikator sowie methodische Hinweise finden Sie in der Tabelle Aktuelle Ergebnisse"}]
[null,null,"Link zur LSN-Online-Datenbank"]

{"sheet":"B5","index":19,"n_rows":113,"n_cols":11,"rows_kept":113,"merged":[[2,2,2,4],[4,2,4,10],[5,2,5,10],[8,1,11,1],[8,2,11,2],[8,3,8,10],[9,3,9,6],[9,7,9,10],[11,3,11,4],[11,5,11,6],[11,7,11,8],[11,9,11,10],[70,2,70,10],[112,2,112,10]]}
[null,null,{"$f":"Kopf","v":"Migration und Teilhabe in Niedersachsen - Integrationsmonitoring 2020 - Regionalinformationen "}]
[]
[]
[]
[null,null,"Indikator B5: Schulabgängerinnen und Schulabgänger ohne Hauptschulabschluss nach Nationalität "]
[null,null,"Tabelle B5-2: Schulabgängerinnen und Schulabgänger ohne Hauptschulabschluss 2005 und 2019 nach Nationalität und Kreisen"]
[]
[]
[null,"AGS","Kreisfreie Stadt\nLandkreis\n(Großstadt, Umland)\nStatistische Region\nLand","Schulabgängerinnen und Schulabgänger ohne Hauptschulabschluss1)"]
[{"$nulls":3},2005,{"$nulls":3},2019]
[{"$nulls":3},"Deutsche","Ausländerinnen und Ausländer","Deutsche","Ausländerinnen und Ausländer","Deutsche","Ausländerinnen und Ausländer","Deutsche","Ausländerinnen und Ausländer"]
[{"$nulls":3},"Anzahl",null,"Prozent",null,"Anzahl",null,"Prozent"]
[null,"1","1","2","3","4","5","6","7","8","9"]
[null,{"v":101,"d":"  101"},{"$f":"VLOOKUP(B14,AGS_Namen!$C$1:$D$58,2,FALSE)","v":"Braunschweig, Stadt"},{"v":202,"d":"  202"},{"v":44,"d":"  44"},{"v":7.224606580829756,"d":"7.2"},{"v":20.46511627906977,"d":"20.5"},{"v":121,"d":"  121"},{"v":27,"d":"  27"},{"v":5.3563523683045595,"d":"5.4"},{"v":17.419354838709676,"d":"17.4"}]
[null,{"v":102,"d":"  102"},{"$f":"VLOOKUP(B15,AGS_Namen!$C$1:$D$58,2,FALSE)","v":"Salzgitter, Stadt"},{"v":61,"d":"  61"},{"v":30,"d":"  30"},{"v":5.565693430656935,"d":"5.6"},{"v":16.483516483516482,"d":"16.5"},{"v":54,"d":"  54"},{"v":32,"d":"  32"},{"v":6.585365853658537,"d":"6.6"},{"v":14.414414414414415,"d":"14.4"}]
[null,{"v":103,"d":"  103"},{"$f":"VLOOKUP(B16,AGS_Namen!$C$1:$D$58,2,FALSE)","v":"Wolfsburg, Stadt"},{"v":87,"d":"  87"},{"v":36,"d":"  36"},{"v":5.9589041095890405,"d":"6.0"},{"v":18.367346938775512,"d":"18.4"},{"v":51,"d":"  51"},{"v":29,"d":"  29"},{"v":4.0476190476190474,"d":"4.0"},{"v":15.508021390374333,"d":"15.5"}]
[null,{"v":151,"d":"  151"},{"$f":"VLOOKUP(B17,AGS_Namen!$C$1:$D$58,2,FALSE)","v":"Gifhorn"},{"v":116,"d":"  116"},{"v":34,"d":"  34"},{"v":5.891315388522092,"d":"5.9"},{"v":38.20224719101123,"d":"38.2"},{"v":47,"d":"  47"},{"v":8,"d":"  8"},{"v":3.1064111037673494,"d":"3.1"},{"v":10.526315789473683,"d":"10.5"}]
[null,{"v":153,"d":"  153"},{"$f":"VLOOKUP(B18,AGS_Namen!$C$1:$D$58,2,FALSE)","v":"Goslar"},{"v":158,"d":"  158"},{"v":33,"d":"  33"},{"v":10.68289384719405,"d":"10.7"},{"v":34.73684210526316,"d":"34.7"},{"v":70,"d":"  70"},{"v":18,"d":"  18"},{"v":6.653992395437262,"d":"6.7"},{"v":18.367346938775512,"d":"18.4"}]
[null,{"v":154,"d":"  154"},{"$f":"VLOOKUP(B19,AGS_Namen!$C$1:$D$58,2,FALSE)","v":"Helmstedt"},{"v":73,"d":"  73"},{"v":6,"d":"  6"},{"v":7.087378640776699,"d":"7.1"},{"v":12.76595744680851,"d":"12.8"},{"v":47,"d":"  47"},{"v":11,"d":"  11"},{"v":7.424960505529225,"d":"7.4"},{"v":20.37037037037037,"d":"20.4"}]
[null,{"v":155,"d":"  155"},{"$f":"VLOOKUP(B20,AGS_Namen!$C$1:$D$58,2,FALSE)","v":"Northeim"},{"v":136,"d":"  136"},{"v":23,"d":"  23"},{"v":8.596713021491782,"d":"8.6"},{"v":28.39506172839506,"d":"28.4"},{"v":53,"d":"  53"},{"v":16,"d":"  16"},{"v":4.308943089430894,"d":"4.3"},{"v":20.253164556962027,"d":"20.3"}]
[null,{"v":157,"d":"  157"},{"$f":"VLOOKUP(B21,AGS_Namen!$C$1:$D$58,2,FALSE)","v":"Peine"},{"v":111,"d":"  111"},{"v":28,"d":"  28"},{"v":8.545034642032332,"d":"8.5"},{"v":22.76422764227642,"d":"22.8"},{"v":37,"d":"  37"},{"v":18,"d":"  18"},{"v":2.948207171314741,"d":"2.9"},{"v":17.82178217821782,"d":"17.8"}]
[null,{"v":158,"d":"  158"},{"$f":"VLOOKUP(B22,AGS_Namen!$C$1:$D$58,2,FALSE)","v":"Wolfenbüttel"},{"v":70,"d":"  70"},{"v":10,"d":"  10"},{"v":6.487488415199258,"d":"6.5"},{"v":16.39344262295082,"d":"16.4"},{"v":43,"d":"  43"},{"v":17,"d":"  17"},{"v":4.540654699049631,"d":"4.5"},{"v":27.419354838709676,"d":"27.4"}]
[null,{"v":159,"d":"  159"},{"$f":"VLOOKUP(B23,AGS_Namen!$C$1:$D$58,2,FALSE)","v":"Göttingen"},{"v":283,"d":"  283"},{"v":72,"d":"  72"},{"v":7.81767955801105,"d":"7.8"},{"v":28.01556420233463,"d":"28.0"},{"v":152,"d":"  152"},{"v":61,"d":"  61"},{"v":5.499276410998553,"d":"5.5"},{"v":25.957446808510635,"d":"26.0"}]
[null,{"v":1,"d":"  1"},{"$f":"VLOOKUP(B24,AGS_Namen!$C$1:$D$58,2,FALSE)","v":"Stat. Region Braunschweig"},{"v":1297,"d":" 1 297"},{"v":316,"d":"  316"},{"v":7.449741527857554,"d":"7.4"},{"v":23.476968796433876,"d":"23.5"},{"v":675,"d":"  675"},{"v":237,"d":"  237"},{"v":4.915167843879706,"d":"4.9"},{"v":18.67612293144208,"d":"18.7"}]
[null,{"v":241,"d":"  241"},{"$f":"VLOOKUP(B25,AGS_Namen!$C$1:$D$58,2,FALSE)","v":"Hannover, Region"},{"v":674,"d":"  674"},{"v":311,"d":"  311"},{"v":6.600724708647538,"d":"6.6"},{"v":19.961489088575096,"d":"20.0"},{"v":401,"d":"  401"},{"v":259,"d":"  259"},{"v":4.05706191825172,"d":"4.1"},{"v":19.75591151792525,"d":"19.8"}]
[null,{"v":241001,"d":" 241 001"},{"$f":"VLOOKUP(B26,AGS_Namen!$C$1:$D$58,2,FALSE)","v":"   dav. Hannover, Lhst."},{"v":297,"d":"  297"},{"v":182,"d":"  182"},{"v":7.302680108187854,"d":"7.3"},{"v":17.94871794871795,"d":"17.9"},{"v":185,"d":"  185"},{"v":135,"d":"  135"},{"v":4.439644828413726,"d":"4.4"},{"v":21.15987460815047,"d":"21.2"}]
[null,{"v":241999,"d":" 241 999"},{"$f":"VLOOKUP(B27,AGS_Namen!$C$1:$D$58,2,FALSE)","v":"   dav. Hannover, Umland"},{"v":377,"d":"  377"},{"v":129,"d":"  129"},{"v":6.136067708333334,"d":"6.1"},{"v":23.713235294117645,"d":"23.7"},{"v":216,"d":"  216"},{"v":124,"d":"  124"},{"v":3.7782053524575825,"d":"3.8"},{"v":18.424962852897476,"d":"18.4"}]
[null,{"v":251,"d":"  251"},{"$f":"VLOOKUP(B28,AGS_Namen!$C$1:$D$58,2,FALSE)","v":"Diepholz"},{"v":128,"d":"  128"},{"v":30,"d":"  30"},{"v":5.348934391976599,"d":"5.3"},{"v":23.809523809523807,"d":"23.8"},{"v":80,"d":"  80"},{"v":43,"d":"  43"},{"v":3.8040893961008084,"d":"3.8"},{"v":28.666666666666668,"d":"28.7"}]
[null,{"v":252,"d":"  252"},{"$f":"VLOOKUP(B29,AGS_Namen!$C$1:$D$58,2,FALSE)","v":"Hameln-Pyrmont"},{"v":151,"d":"  151"},{"v":47,"d":"  47"},{"v":9.830729166666668,"d":"9.8"},{"v":30.519480519480517,"d":"30.5"},{"v":93,"d":"  93"},{"v":54,"d":"  54"},{"v":7.616707616707617,"d":"7.6"},{"v":31.57894736842105,"d":"31.6"}]
[null,{"v":254,"d":"  254"},{"$f":"VLOOKUP(B30,AGS_Namen!$C$1:$D$58,2,FALSE)","v":"Hildesheim"},{"v":244,"d":"  244"},{"v":82,"d":"  82"},{"v":8.307797071842016,"d":"8.3"},{"v":28.87323943661972,"d":"28.9"},{"v":139,"d":"  139"},{"v":72,"d":"  72"},{"v":5.2314640572073765,"d":"5.2"},{"v":27.480916030534353,"d":"27.5"}]
[null,{"v":255,"d":"  255"},{"$f":"VLOOKUP(B31,AGS_Namen!$C$1:$D$58,2,FALSE)","v":"Holzminden"},{"v":55,"d":"  55"},{"v":6,"d":"  6"},{"v":7.7355836849507735,"d":"7.7"},{"v":14.634146341463413,"d":"14.6"},{"v":56,"d":"  56"},{"v":7,"d":"  7"},{"v":11.642411642411643,"d":"11.6"},{"v":20.588235294117645,"d":"20.6"}]
[null,{"v":256,"d":"  256"},{"$f":"VLOOKUP(B32,AGS_Namen!$C$1:$D$58,2,FALSE)","v":"Nienburg (Weser)"},{"v":102,"d":"  102"},{"v":34,"d":"  34"},{"v":7.7039274924471295,"d":"7.7"},{"v":29.82456140350877,"d":"29.8"},{"v":60,"d":"  60"},{"v":25,"d":"  25"},{"v":5.2493438320209975,"d":"5.2"},{"v":20.161290322580644,"d":"20.2"}]
[null,{"v":257,"d":"  257"},{"$f":"VLOOKUP(B33,AGS_Namen!$C$1:$D$58,2,FALSE)","v":"Schaumburg"},{"v":141,"d":"  141"},{"v":23,"d":"  23"},{"v":9.161793372319687,"d":"9.2"},{"v":13.450292397660817,"d":"13.5"},{"v":92,"d":"  92"},{"v":30,"d":"  30"},{"v":6.7547723935389135,"d":"6.8"},{"v":22.900763358778626,"d":"22.9"}]
[null,{"v":2,"d":"  2"},{"$f":"VLOOKUP(B34,AGS_Namen!$C$1:$D$58,2,FALSE)","v":"Stat. Region Hannover"},{"v":1495,"d":" 1 495"},{"v":533,"d":"  533"},{"v":7.239358868819911,"d":"7.2"},{"v":21.772875816993466,"d":"21.8"},{"v":921,"d":"  921"},{"v":490,"d":"  490"},{"v":4.8856824571640765,"d":"4.9"},{"v":22.44617498854787,"d":"22.4"}]
[null,{"v":351,"d":"  351"},{"$f":"VLOOKUP(B35,AGS_Namen!$C$1:$D$58,2,FALSE)","v":"Celle"},{"v":181,"d":"  181"},{"v":50,"d":"  50"},{"v":8.81636629322942,"d":"8.8"},{"v":27.027027027027028,"d":"27.0"},{"v":93,"d":"  93"},{"v":30,"d":"  30"},{"v":5.8088694565896315,"d":"5.8"},{"v":24.793388429752067,"d":"24.8"}]
[null,{"v":352,"d":"  352"},{"$f":"VLOOKUP(B36,AGS_Namen!$C$1:$D$58,2,FALSE)","v":"Cuxhaven"},{"v":180,"d":"  180"},{"v":42,"d":"  42"},{"v":9.07715582450832,"d":"9.1"},{"v":35,"d":"35.0"},{"v":116,"d":"  116"},{"v":35,"d":"  35"},{"v":6.9586082783443315,"d":"7.0"},{"v":27.34375,"d":"27.3"}]
[null,{"v":353,"d":"  353"},{"$f":"VLOOKUP(B37,AGS_Namen!$C$1:$D$58,2,FALSE)","v":"Harburg"},{"v":159,"d":"  159"},{"v":41,"d":"  41"},{"v":6.847545219638243,"d":"6.8"},{"v":37.96296296296296,"d":"38.0"},{"v":99,"d":"  99"},{"v":21,"d":"  21"},{"v":4.388297872340425,"d":"4.4"},{"v":18.103448275862068,"d":"18.1"}]
[null,{"v":354,"d":"  354"},{"$f":"VLOOKUP(B38,AGS_Namen!$C$1:$D$58,2,FALSE)","v":"Lüchow-Dannenberg"},{"v":63,"d":"  63"},{"v":8,"d":"  8"},{"v":9.559939301972687,"d":"9.6"},{"v":57.14285714285714,"d":"57.1"},{"v":40,"d":"  40"},{"v":3,"d":"  3"},{"v":7.490636704119851,"d":"7.5"},{"v":16.666666666666664,"d":"16.7"}]
[null,{"v":355,"d":"  355"},{"$f":"VLOOKUP(B39,AGS_Namen!$C$1:$D$58,2,FALSE)","v":"Lüneburg"},{"v":105,"d":"  105"},{"v":22,"d":"  22"},{"v":5.843071786310518,"d":"5.8"},{"v":26.506024096385545,"d":"26.5"},{"v":82,"d":"  82"},{"v":27,"d":"  27"},{"v":4.617117117117117,"d":"4.6"},{"v":20.30075187969925,"d":"20.3"}]
[null,{"v":356,"d":"  356"},{"$f":"VLOOKUP(B40,AGS_Namen!$C$1:$D$58,2,FALSE)","v":"Osterholz"},{"v":63,"d":"  63"},{"v":21,"d":"  21"},{"v":5.536028119507909,"d":"5.5"},37.5,{"v":35,"d":"  35"},{"v":13,"d":"  13"},{"v":3.5641547861507124,"d":"3.6"},{"v":28.888888888888886,"d":"28.9"}]
[null,{"v":357,"d":"  357"},{"$f":"VLOOKUP(B41,AGS_Namen!$C$1:$D$58,2,FALSE)","v":"Rotenburg (Wümme)"},{"v":218,"d":"  218"},{"v":18,"d":"  18"},{"v":11.266149870801033,"d":"11.3"},{"v":20.224719101123593,"d":"20.2"},{"v":131,"d":"  131"},{"v":28,"d":"  28"},{"v":7.384441939120631,"d":"7.4"},{"v":30.76923076923077,"d":"30.8"}]
[null,{"v":358,"d":"  358"},{"$f":"VLOOKUP(B42,AGS_Namen!$C$1:$D$58,2,FALSE)","v":"Heidekreis"},{"v":143,"d":"  143"},{"v":33,"d":"  33"},{"v":9.166666666666666,"d":"9.2"},{"v":28.695652173913043,"d":"28.7"},{"v":72,"d":"  72"},{"v":13,"d":"  13"},{"v":5.313653136531365,"d":"5.3"},{"v":19.696969696969695,"d":"19.7"}]
[null,{"v":359,"d":"  359"},{"$f":"VLOOKUP(B43,AGS_Namen!$C$1:$D$58,2,FALSE)","v":"Stade"},{"v":193,"d":"  193"},{"v":28,"d":"  28"},{"v":9.203624225083452,"d":"9.2"},{"v":25.688073394495415,"d":"25.7"},{"v":105,"d":"  105"},{"v":36,"d":"  36"},{"v":5.22128294380905,"d":"5.2"},{"v":26.865671641791046,"d":"26.9"}]
[null,{"v":360,"d":"  360"},{"$f":"VLOOKUP(B44,AGS_Namen!$C$1:$D$58,2,FALSE)","v":"Uelzen"},{"v":111,"d":"  111"},{"v":19,"d":"  19"},{"v":9.919571045576408,"d":"9.9"},{"v":45.23809523809524,"d":"45.2"},{"v":72,"d":"  72"},{"v":9,"d":"  9"},{"v":8.653846153846153,"d":"8.7"},{"v":25.71428571428571,"d":"25.7"}]
[null,{"v":361,"d":"  361"},{"$f":"VLOOKUP(B45,AGS_Namen!$C$1:$D$58,2,FALSE)","v":"Verden"},{"v":125,"d":"  125"},{"v":47,"d":"  47"},{"v":8.164598301763554,"d":"8.2"},{"v":35.60606060606061,"d":"35.6"},{"v":55,"d":"  55"},{"v":14,"d":"  14"},{"v":4.188880426504189,"d":"4.2"},{"v":26.923076923076923,"d":"26.9"}]
[null,{"v":3,"d":"  3"},{"$f":"VLOOKUP(B46,AGS_Namen!$C$1:$D$58,2,FALSE)","v":"Stat. Region Lüneburg"},{"v":1541,"d":" 1 541"},{"v":329,"d":"  329"},{"v":8.46982521710454,"d":"8.5"},{"v":31.24406457739791,"d":"31.2"},{"v":900,"d":"  900"},{"v":229,"d":"  229"},{"v":5.589714924538849,"d":"5.6"},{"v":24.38764643237487,"d":"24.4"}]
[null,{"v":401,"d":"  401"},{"$f":"VLOOKUP(B47,AGS_Namen!$C$1:$D$58,2,FALSE)","v":"Delmenhorst, Stadt"},{"v":77,"d":"  77"},{"v":34,"d":"  34"},{"v":10.131578947368421,"d":"10.1"},{"v":25.563909774436087,"d":"25.6"},{"v":42,"d":"  42"},{"v":68,"d":"  68"},{"v":6.278026905829597,"d":"6.3"},{"v":41.21212121212121,"d":"41.2"}]
[null,{"v":402,"d":"  402"},{"$f":"VLOOKUP(B48,AGS_Namen!$C$1:$D$58,2,FALSE)","v":"Emden, Stadt"},{"v":58,"d":"  58"},{"v":20,"d":"  20"},{"v":9.948542024013722,"d":"9.9"},{"v":45.45454545454545,"d":"45.5"},{"v":33,"d":"  33"},{"v":14,"d":"  14"},{"v":6.991525423728813,"d":"7.0"},{"v":26.923076923076923,"d":"26.9"}]
[null,{"v":403,"d":"  403"},{"$f":"VLOOKUP(B49,AGS_Namen!$C$1:$D$58,2,FALSE)","v":"Oldenburg (Oldb), Stadt"},{"v":118,"d":"  118"},{"v":26,"d":"  26"},{"v":6.789413118527042,"d":"6.8"},{"v":29.545454545454547,"d":"29.5"},{"v":65,"d":"  65"},{"v":26,"d":"  26"},{"v":3.4427966101694913,"d":"3.4"},{"v":19.25925925925926,"d":"19.3"}]
[null,{"v":404,"d":"  404"},{"$f":"VLOOKUP(B50,AGS_Namen!$C$1:$D$58,2,FALSE)","v":"Osnabrück, Stadt"},{"v":76,"d":"  76"},{"v":36,"d":"  36"},{"v":3.9707419017763845,"d":"4.0"},{"v":16.51376146788991,"d":"16.5"},{"v":67,"d":"  67"},{"v":48,"d":"  48"},{"v":3.5468501852832186,"d":"3.5"},{"v":19.834710743801654,"d":"19.8"}]
[null,{"v":405,"d":"  405"},{"$f":"VLOOKUP(B51,AGS_Namen!$C$1:$D$58,2,FALSE)","v":"Wilhelmshaven, Stadt"},{"v":80,"d":"  80"},{"v":20,"d":"  20"},{"v":8.040201005025125,"d":"8.0"},{"v":27.027027027027028,"d":"27.0"},{"v":33,"d":"  33"},{"v":19,"d":"  19"},{"v":5.84070796460177,"d":"5.8"},{"v":27.941176470588236,"d":"27.9"}]
[null,{"v":451,"d":"  451"},{"$f":"VLOOKUP(B52,AGS_Namen!$C$1:$D$58,2,FALSE)","v":"Ammerland"},{"v":117,"d":"  117"},{"v":15,"d":"  15"},{"v":9.034749034749034,"d":"9.0"},{"v":30.612244897959183,"d":"30.6"},{"v":92,"d":"  92"},{"v":3,"d":"  3"},{"v":7.437348423605497,"d":"7.4"},{"v":4.054054054054054,"d":"4.1"}]
[null,{"v":452,"d":"  452"},{"$f":"VLOOKUP(B53,AGS_Namen!$C$1:$D$58,2,FALSE)","v":"Aurich"},{"v":279,"d":"  279"},{"v":24,"d":"  24"},{"v":11.683417085427136,"d":"11.7"},{"v":30,"d":"30.0"},{"v":154,"d":"  154"},{"v":24,"d":"  24"},{"v":8.213333333333333,"d":"8.2"},{"v":23.076923076923077,"d":"23.1"}]
[null,{"v":453,"d":"  453"},{"$f":"VLOOKUP(B54,AGS_Namen!$C$1:$D$58,2,FALSE)","v":"Cloppenburg"},{"v":176,"d":"  176"},{"v":24,"d":"  24"},{"v":8.498309995171414,"d":"8.5"},{"v":36.36363636363637,"d":"36.4"},{"v":147,"d":"  147"},{"v":61,"d":"  61"},{"v":7.503828483920367,"d":"7.5"},{"v":34.85714285714286,"d":"34.9"}]
[null,{"v":454,"d":"  454"},{"$f":"VLOOKUP(B55,AGS_Namen!$C$1:$D$58,2,FALSE)","v":"Emsland"},{"v":319,"d":"  319"},{"v":38,"d":"  38"},{"v":7.346844771994472,"d":"7.3"},{"v":37.62376237623762,"d":"37.6"},{"v":196,"d":"  196"},{"v":88,"d":"  88"},{"v":5.857740585774058,"d":"5.9"},{"v":36.21399176954733,"d":"36.2"}]
[null,{"v":455,"d":"  455"},{"$f":"VLOOKUP(B56,AGS_Namen!$C$1:$D$58,2,FALSE)","v":"Friesland"},{"v":103,"d":"  103"},{"v":11,"d":"  11"},{"v":10.269192422731804,"d":"10.3"},{"v":32.35294117647059,"d":"32.4"},{"v":65,"d":"  65"},{"v":14,"d":"  14"},{"v":7.765830346475508,"d":"7.8"},{"v":25,"d":"25.0"}]
[null,{"v":456,"d":"  456"},{"$f":"VLOOKUP(B57,AGS_Namen!$C$1:$D$58,2,FALSE)","v":"Grafschaft Bentheim"},{"v":159,"d":"  159"},{"v":28,"d":"  28"},{"v":10.29126213592233,"d":"10.3"},{"v":27.450980392156865,"d":"27.5"},{"v":72,"d":"  72"},{"v":33,"d":"  33"},{"v":5.3019145802650955,"d":"5.3"},{"v":18.53932584269663,"d":"18.5"}]
[null,{"v":457,"d":"  457"},{"$f":"VLOOKUP(B58,AGS_Namen!$C$1:$D$58,2,FALSE)","v":"Leer"},{"v":192,"d":"  192"},{"v":23,"d":"  23"},{"v":9.861325115562405,"d":"9.9"},{"v":34.84848484848485,"d":"34.8"},{"v":98,"d":"  98"},{"v":34,"d":"  34"},{"v":6.102117061021171,"d":"6.1"},{"v":28.8135593220339,"d":"28.8"}]
[null,{"v":458,"d":"  458"},{"$f":"VLOOKUP(B59,AGS_Namen!$C$1:$D$58,2,FALSE)","v":"Oldenburg"},{"v":78,"d":"  78"},{"v":15,"d":"  15"},{"v":6.30048465266559,"d":"6.3"},{"v":27.77777777777778,"d":"27.8"},{"v":46,"d":"  46"},{"v":15,"d":"  15"},{"v":4.035087719298246,"d":"4.0"},{"v":14.85148514851485,"d":"14.9"}]
[null,{"v":459,"d":"  459"},{"$f":"VLOOKUP(B60,AGS_Namen!$C$1:$D$58,2,FALSE)","v":"Osnabrück"},{"v":273,"d":"  273"},{"v":68,"d":"  68"},{"v":7.144726511384454,"d":"7.1"},{"v":27.983539094650205,"d":"28.0"},{"v":150,"d":"  150"},{"v":51,"d":"  51"},{"v":5.021760964178105,"d":"5.0"},{"v":26.288659793814436,"d":"26.3"}]
[null,{"v":460,"d":"  460"},{"$f":"VLOOKUP(B61,AGS_Namen!$C$1:$D$58,2,FALSE)","v":"Vechta"},{"v":142,"d":"  142"},{"v":30,"d":"  30"},{"v":7.862679955703211,"d":"7.9"},{"v":23.62204724409449,"d":"23.6"},{"v":89,"d":"  89"},{"v":40,"d":"  40"},{"v":5.576441102756892,"d":"5.6"},{"v":29.850746268656714,"d":"29.9"}]
[null,{"v":461,"d":"  461"},{"$f":"VLOOKUP(B62,AGS_Namen!$C$1:$D$58,2,FALSE)","v":"Wesermarsch"},{"v":91,"d":"  91"},{"v":10,"d":"  10"},{"v":7.332796132151491,"d":"7.3"},{"v":14.492753623188406,"d":"14.5"},{"v":36,"d":"  36"},{"v":11,"d":"  11"},{"v":4.2105263157894735,"d":"4.2"},{"v":11.827956989247312,"d":"11.8"}]
[null,{"v":462,"d":"  462"},{"$f":"VLOOKUP(B63,AGS_Namen!$C$1:$D$58,2,FALSE)","v":"Wittmund"},{"v":67,"d":"  67"},{"v":7,"d":"  7"},{"v":9.781021897810218,"d":"9.8"},{"v":25.925925925925924,"d":"25.9"},{"v":27,"d":"  27"},{"v":11,"d":"  11"},{"v":4.134762633996937,"d":"4.1"},{"v":34.375,"d":"34.4"}]
[null,{"v":4,"d":"  4"},{"$f":"VLOOKUP(B64,AGS_Namen!$C$1:$D$58,2,FALSE)","v":"Stat. Region Weser-Ems"},{"v":2405,"d":" 2 405"},{"v":429,"d":"  429"},{"v":8.188070271006401,"d":"8.2"},{"v":27.23809523809524,"d":"27.2"},{"v":1412,"d":" 1 412"},{"v":560,"d":"  560"},{"v":5.663404460131558,"d":"5.7"},{"v":25.87800369685767,"d":"25.9"}]
[null,{"v":0,"d":"  0"},{"$f":"VLOOKUP(B65,AGS_Namen!$C$1:$D$58,2,FALSE)","v":"Niedersachsen"},{"v":6738,"d":" 6 738"},{"v":1607,"d":" 1 607"},{"v":7.869013278521962,"d":"7.9"},{"v":25.023357209592028,"d":"25.0"},{"v":3908,"d":" 3 908"},{"v":1516,"d":" 1 516"},{"v":5.308556447559667,"d":"5.3"},{"v":23.12738367658276,"d":"23.1"}]
[]
[null,null,"1) einschließlich Abgängerinnen/Abgänger der Förderschulen"]
[]
[null,null,"Quelle: Schulstatistik"]
[]
[null,null,"Karte B5-2: Anteil der ausländischen Schulabgängerinnen und Schulabgänger ohne Hauptschulabschluss an allen ausländischen Schulabgängerinnen und Schulabgängern 2019 in Prozent"]
{"$rows_empty":40}
[null,null,{"$f":"Def","v":"Die Definition zu dem Indikator sowie methodische Hinweise finden Sie in der Tabelle Aktuelle Ergebnisse"}]
[null,null,"Link zur LSN-Online-Datenbank"]

{"sheet":"C4","index":20,"n_rows":115,"n_cols":10,"rows_kept":115,"merged":[[2,2,2,4],[9,2,11,2],[9,3,9,5],[9,6,9,9],[11,3,11,5],[11,6,11,9],[65,2,67,9],[72,2,72,13],[114,2,114,10]]}
[null,null,{"$f":"Kopf","v":"Migration und Teilhabe in Niedersachsen - Integrationsmonitoring 2020 - Regionalinformationen "}]
[]
[]
[]
[]
[null,null,"Indikator C4: Sozialversicherungspflichtig beschäftigte Ausländerinnen und Ausländer nach Art der Ausbildung"]
[null,null,"Tabelle C4-2: Sozialversicherungspflichtig beschäftigte Ausländerinnen und Ausländer am 30.06.2019 nach Art der Ausbildung nach Kreisen"]
[]
[]
[null,null,"Kreisfreie Stadt\nLandkreis\n(Großstadt, Umland)\nStatistische Region\nLand","Sozialversicherungspflichtig\nbeschäftigte Ausländerinnen und Ausländer",null,null,"Darunter nach Qualifikation1)"]
[{"$nulls":3},"Insgesamt","Männer","Frauen","hoch","mittel","niedrig","unbekannt"]
[{"$nulls":3},"Anzahl",null,null,"Prozent"]
[null,"Spalte1","1","2","3","4","5","6","7","8"]
[null,101,{"$f":"VLOOKUP(DAentabelle_C4[[#This Row],[Spalte1]],AGS_Namen!$C$1:$D$58,2,FALSE)","v":"Braunschweig, Stadt"},{"v":11157,"d":" 11 157"},{"v":6758,"d":" 6 758"},{"v":4399,"d":" 4 399"},{"v":23.438200233037556,"d":"23.4"},{"v":27.686654118490633,"d":"27.7"},{"v":23.877386394191987,"d":"23.9"},{"v":24.997759254279824,"d":"25.0"}]
[null,102,{"$f":"VLOOKUP(DAentabelle_C4[[#This Row],[Spalte1]],AGS_Namen!$C$1:$D$58,2,FALSE)","v":"Salzgitter, Stadt"},{"v":4747,"d":" 4 747"},{"v":3672,"d":" 3 672"},{"v":1075,"d":" 1 075"},{"v":8.531704234253212,"d":"8.5"},{"v":41.03644406993891,"d":"41.0"},{"v":22.793343164103643,"d":"22.8"},{"v":27.638508531704232,"d":"27.6"}]
[null,103,{"$f":"VLOOKUP(DAentabelle_C4[[#This Row],[Spalte1]],AGS_Namen!$C$1:$D$58,2,FALSE)","v":"Wolfsburg, Stadt"},{"v":10288,"d":" 10 288"},{"v":7063,"d":" 7 063"},{"v":3225,"d":" 3 225"},{"v":23.930793157076206,"d":"23.9"},{"v":33.009331259720064,"d":"33.0"},{"v":14.725894245723172,"d":"14.7"},{"v":28.33398133748056,"d":"28.3"}]
[null,151,{"$f":"VLOOKUP(DAentabelle_C4[[#This Row],[Spalte1]],AGS_Namen!$C$1:$D$58,2,FALSE)","v":"Gifhorn"},{"v":3040,"d":" 3 040"},{"v":2038,"d":" 2 038"},{"v":1002,"d":" 1 002"},{"v":16.710526315789473,"d":"16.7"},{"v":25.986842105263158,"d":"26.0"},{"v":24.638157894736842,"d":"24.6"},{"v":32.66447368421053,"d":"32.7"}]
[null,153,{"$f":"VLOOKUP(DAentabelle_C4[[#This Row],[Spalte1]],AGS_Namen!$C$1:$D$58,2,FALSE)","v":"Goslar"},{"v":3119,"d":" 3 119"},{"v":1991,"d":" 1 991"},{"v":1128,"d":" 1 128"},{"v":16.67201025969862,"d":"16.7"},{"v":30.522603398525167,"d":"30.5"},{"v":25.55306187880731,"d":"25.6"},{"v":27.2523244629689,"d":"27.3"}]
[null,154,{"$f":"VLOOKUP(DAentabelle_C4[[#This Row],[Spalte1]],AGS_Namen!$C$1:$D$58,2,FALSE)","v":"Helmstedt"},{"v":1557,"d":" 1 557"},{"v":1083,"d":" 1 083"},{"v":474,"d":"  474"},{"v":12.780989081567116,"d":"12.8"},{"v":42.26075786769428,"d":"42.3"},{"v":22.41490044958253,"d":"22.4"},{"v":22.54335260115607,"d":"22.5"}]
[null,155,{"$f":"VLOOKUP(DAentabelle_C4[[#This Row],[Spalte1]],AGS_Namen!$C$1:$D$58,2,FALSE)","v":"Northeim"},{"v":3377,"d":" 3 377"},{"v":2552,"d":" 2 552"},{"v":825,"d":"  825"},{"v":9.623926562037312,"d":"9.6"},{"v":44.15161385845425,"d":"44.2"},{"v":23.097423748889547,"d":"23.1"},{"v":23.127035830618894,"d":"23.1"}]
[null,157,{"$f":"VLOOKUP(DAentabelle_C4[[#This Row],[Spalte1]],AGS_Namen!$C$1:$D$58,2,FALSE)","v":"Peine"},{"v":3351,"d":" 3 351"},{"v":2439,"d":" 2 439"},{"v":912,"d":"  912"},{"v":6.057893166219039,"d":"6.1"},{"v":29.36436884512086,"d":"29.4"},{"v":28.91674127126231,"d":"28.9"},{"v":35.66099671739779,"d":"35.7"}]
[null,158,{"$f":"VLOOKUP(DAentabelle_C4[[#This Row],[Spalte1]],AGS_Namen!$C$1:$D$58,2,FALSE)","v":"Wolfenbüttel"},{"v":1510,"d":" 1 510"},{"v":969,"d":"  969"},{"v":541,"d":"  541"},{"v":12.781456953642385,"d":"12.8"},{"v":40.66225165562914,"d":"40.7"},{"v":22.71523178807947,"d":"22.7"},{"v":23.841059602649008,"d":"23.8"}]
[null,159,{"$f":"VLOOKUP(DAentabelle_C4[[#This Row],[Spalte1]],AGS_Namen!$C$1:$D$58,2,FALSE)","v":"Göttingen"},{"v":9450,"d":" 9 450"},{"v":5838,"d":" 5 838"},{"v":3612,"d":" 3 612"},{"v":28.582010582010582,"d":"28.6"},{"v":28.264550264550266,"d":"28.3"},{"v":24.825396825396826,"d":"24.8"},{"v":18.32804232804233,"d":"18.3"}]
[null,1,{"$f":"VLOOKUP(DAentabelle_C4[[#This Row],[Spalte1]],AGS_Namen!$C$1:$D$58,2,FALSE)","v":"Stat. Region Braunschweig"},{"v":51596,"d":" 51 596"},{"v":34403,"d":" 34 403"},{"v":17193,"d":" 17 193"},{"v":19.63524304209629,"d":"19.6"},{"v":32.159469726335374,"d":"32.2"},{"v":22.470734165439183,"d":"22.5"},{"v":25.73455306612916,"d":"25.7"}]
[null,241,{"$f":"VLOOKUP(DAentabelle_C4[[#This Row],[Spalte1]],AGS_Namen!$C$1:$D$58,2,FALSE)","v":"Hannover, Region"},{"v":60737,"d":" 60 737"},{"v":38040,"d":" 38 040"},{"v":22697,"d":" 22 697"},{"v":13.260450796055123,"d":"13.3"},{"v":32.5057213889392,"d":"32.5"},{"v":27.582857236939592,"d":"27.6"},{"v":26.650970578066087,"d":"26.7"}]
[null,241001,{"$f":"VLOOKUP(DAentabelle_C4[[#This Row],[Spalte1]],AGS_Namen!$C$1:$D$58,2,FALSE)","v":"   dav. Hannover, Lhst."},{"v":38360,"d":" 38 360"},{"v":23217,"d":" 23 217"},{"v":15143,"d":" 15 143"},{"v":16.44160583941606,"d":"16.4"},{"v":31.850886339937436,"d":"31.9"},{"v":26.736183524504693,"d":"26.7"},{"v":24.971324296141812,"d":"25.0"}]
[null,241999,{"$f":"VLOOKUP(DAentabelle_C4[[#This Row],[Spalte1]],AGS_Namen!$C$1:$D$58,2,FALSE)","v":"   dav. Hannover, Umland"},{"v":22377,"d":" 22 377"},{"v":14823,"d":" 14 823"},{"v":7554,"d":" 7 554"},{"v":7.807123385619162,"d":"7.8"},{"v":33.628279036510705,"d":"33.6"},{"v":29.034276265808646,"d":"29.0"},{"v":29.530321312061492,"d":"29.5"}]
[null,251,{"$f":"VLOOKUP(DAentabelle_C4[[#This Row],[Spalte1]],AGS_Namen!$C$1:$D$58,2,FALSE)","v":"Diepholz"},{"v":6222,"d":" 6 222"},{"v":4331,"d":" 4 331"},{"v":1891,"d":" 1 891"},{"v":7.03953712632594,"d":"7.0"},{"v":31.870781099324976,"d":"31.9"},{"v":25.281260045001606,"d":"25.3"},{"v":35.80842172934748,"d":"35.8"}]
[null,252,{"$f":"VLOOKUP(DAentabelle_C4[[#This Row],[Spalte1]],AGS_Namen!$C$1:$D$58,2,FALSE)","v":"Hameln-Pyrmont"},{"v":4052,"d":" 4 052"},{"v":2542,"d":" 2 542"},{"v":1510,"d":" 1 510"},{"v":10.784797630799606,"d":"10.8"},{"v":36.99407699901283,"d":"37.0"},{"v":27.665350444225073,"d":"27.7"},{"v":24.55577492596249,"d":"24.6"}]
[null,254,{"$f":"VLOOKUP(DAentabelle_C4[[#This Row],[Spalte1]],AGS_Namen!$C$1:$D$58,2,FALSE)","v":"Hildesheim"},{"v":6219,"d":" 6 219"},{"v":4059,"d":" 4 059"},{"v":2160,"d":" 2 160"},{"v":16.739025566811385,"d":"16.7"},{"v":34.651873291525966,"d":"34.7"},{"v":25.373854317414374,"d":"25.4"},{"v":23.23524682424827,"d":"23.2"}]
[null,255,{"$f":"VLOOKUP(DAentabelle_C4[[#This Row],[Spalte1]],AGS_Namen!$C$1:$D$58,2,FALSE)","v":"Holzminden"},{"v":1421,"d":" 1 421"},{"v":945,"d":"  945"},{"v":476,"d":"  476"},{"v":12.737508796622096,"d":"12.7"},{"v":32.58268824771288,"d":"32.6"},{"v":27.867698803659394,"d":"27.9"},{"v":26.81210415200563,"d":"26.8"}]
[null,256,{"$f":"VLOOKUP(DAentabelle_C4[[#This Row],[Spalte1]],AGS_Namen!$C$1:$D$58,2,FALSE)","v":"Nienburg (Weser)"},{"v":4261,"d":" 4 261"},{"v":3042,"d":" 3 042"},{"v":1219,"d":" 1 219"},{"v":5.773292654306501,"d":"5.8"},{"v":24.524759446139402,"d":"24.5"},{"v":24.689040131424548,"d":"24.7"},{"v":45.012907768129544,"d":"45.0"}]
[null,257,{"$f":"VLOOKUP(DAentabelle_C4[[#This Row],[Spalte1]],AGS_Namen!$C$1:$D$58,2,FALSE)","v":"Schaumburg"},{"v":3689,"d":" 3 689"},{"v":2420,"d":" 2 420"},{"v":1269,"d":" 1 269"},{"v":8.647329899701816,"d":"8.6"},{"v":43.34507996747086,"d":"43.3"},{"v":26.24017348875034,"d":"26.2"},{"v":21.767416644076985,"d":"21.8"}]
[null,2,{"$f":"VLOOKUP(DAentabelle_C4[[#This Row],[Spalte1]],AGS_Namen!$C$1:$D$58,2,FALSE)","v":"Stat. Region Hannover"},{"v":86601,"d":" 86 601"},{"v":55379,"d":" 55 379"},{"v":31222,"d":" 31 222"},{"v":12.373991062458863,"d":"12.4"},{"v":32.89453932402628,"d":"32.9"},{"v":27.067816768859483,"d":"27.1"},{"v":27.663652844655374,"d":"27.7"}]
[null,351,{"$f":"VLOOKUP(DAentabelle_C4[[#This Row],[Spalte1]],AGS_Namen!$C$1:$D$58,2,FALSE)","v":"Celle"},{"v":3847,"d":" 3 847"},{"v":2498,"d":" 2 498"},{"v":1349,"d":" 1 349"},{"v":14.088900441902782,"d":"14.1"},{"v":31.089160384715363,"d":"31.1"},{"v":30.387314790746036,"d":"30.4"},{"v":24.43462438263582,"d":"24.4"}]
[null,352,{"$f":"VLOOKUP(DAentabelle_C4[[#This Row],[Spalte1]],AGS_Namen!$C$1:$D$58,2,FALSE)","v":"Cuxhaven"},{"v":4262,"d":" 4 262"},{"v":2846,"d":" 2 846"},{"v":1416,"d":" 1 416"},{"v":6.428906616611919,"d":"6.4"},{"v":29.89206945096199,"d":"29.9"},{"v":25.668700140778977,"d":"25.7"},{"v":38.01032379164712,"d":"38.0"}]
[null,353,{"$f":"VLOOKUP(DAentabelle_C4[[#This Row],[Spalte1]],AGS_Namen!$C$1:$D$58,2,FALSE)","v":"Harburg"},{"v":9048,"d":" 9 048"},{"v":6600,"d":" 6 600"},{"v":2448,"d":" 2 448"},{"v":7.040229885057471,"d":"7.0"},{"v":26.79045092838196,"d":"26.8"},{"v":28.547745358090186,"d":"28.5"},{"v":37.62157382847038,"d":"37.6"}]
[null,354,{"$f":"VLOOKUP(DAentabelle_C4[[#This Row],[Spalte1]],AGS_Namen!$C$1:$D$58,2,FALSE)","v":"Lüchow-Dannenberg"},{"v":713,"d":"  713"},{"v":457,"d":"  457"},{"v":256,"d":"  256"},{"v":9.537166900420758,"d":"9.5"},{"v":32.25806451612903,"d":"32.3"},{"v":17.391304347826086,"d":"17.4"},{"v":40.813464235624124,"d":"40.8"}]
[null,355,{"$f":"VLOOKUP(DAentabelle_C4[[#This Row],[Spalte1]],AGS_Namen!$C$1:$D$58,2,FALSE)","v":"Lüneburg"},{"v":3903,"d":" 3 903"},{"v":2552,"d":" 2 552"},{"v":1351,"d":" 1 351"},{"v":13.553676658980272,"d":"13.6"},{"v":31.20676402767102,"d":"31.2"},{"v":27.36356648731745,"d":"27.4"},{"v":27.875992826031258,"d":"27.9"}]
[null,356,{"$f":"VLOOKUP(DAentabelle_C4[[#This Row],[Spalte1]],AGS_Namen!$C$1:$D$58,2,FALSE)","v":"Osterholz"},{"v":1985,"d":" 1 985"},{"v":1395,"d":" 1 395"},{"v":590,"d":"  590"},{"v":9.42065491183879,"d":"9.4"},{"v":32.695214105793454,"d":"32.7"},{"v":26.347607052896727,"d":"26.3"},{"v":31.536523929471034,"d":"31.5"}]
[null,357,{"$f":"VLOOKUP(DAentabelle_C4[[#This Row],[Spalte1]],AGS_Namen!$C$1:$D$58,2,FALSE)","v":"Rotenburg (Wümme)"},{"v":4111,"d":" 4 111"},{"v":2823,"d":" 2 823"},{"v":1288,"d":" 1 288"},{"v":8.878618341036244,"d":"8.9"},{"v":35.87934809048893,"d":"35.9"},{"v":23.960107029919726,"d":"24.0"},{"v":31.281926538555098,"d":"31.3"}]
[null,358,{"$f":"VLOOKUP(DAentabelle_C4[[#This Row],[Spalte1]],AGS_Namen!$C$1:$D$58,2,FALSE)","v":"Heidekreis"},{"v":4245,"d":" 4 245"},{"v":2765,"d":" 2 765"},{"v":1480,"d":" 1 480"},{"v":7.467608951707891,"d":"7.5"},{"v":35.948174322732626,"d":"35.9"},{"v":21.43698468786808,"d":"21.4"},{"v":35.1472320376914,"d":"35.1"}]
[null,359,{"$f":"VLOOKUP(DAentabelle_C4[[#This Row],[Spalte1]],AGS_Namen!$C$1:$D$58,2,FALSE)","v":"Stade"},{"v":5633,"d":" 5 633"},{"v":4017,"d":" 4 017"},{"v":1616,"d":" 1 616"},{"v":8.290431386472573,"d":"8.3"},{"v":24.729273921533817,"d":"24.7"},{"v":22.048641931475235,"d":"22.0"},{"v":44.931652760518375,"d":"44.9"}]
[null,360,{"$f":"VLOOKUP(DAentabelle_C4[[#This Row],[Spalte1]],AGS_Namen!$C$1:$D$58,2,FALSE)","v":"Uelzen"},{"v":1615,"d":" 1 615"},{"v":1016,"d":" 1 016"},{"v":599,"d":"  599"},{"v":14.489164086687307,"d":"14.5"},{"v":35.60371517027864,"d":"35.6"},{"v":22.229102167182663,"d":"22.2"},{"v":27.678018575851393,"d":"27.7"}]
[null,361,{"$f":"VLOOKUP(DAentabelle_C4[[#This Row],[Spalte1]],AGS_Namen!$C$1:$D$58,2,FALSE)","v":"Verden"},{"v":4890,"d":" 4 890"},{"v":3456,"d":" 3 456"},{"v":1434,"d":" 1 434"},{"v":8.118609406952965,"d":"8.1"},{"v":26.40081799591002,"d":"26.4"},{"v":26.012269938650306,"d":"26.0"},{"v":39.46830265848671,"d":"39.5"}]
[null,3,{"$f":"VLOOKUP(DAentabelle_C4[[#This Row],[Spalte1]],AGS_Namen!$C$1:$D$58,2,FALSE)","v":"Stat. Region Lüneburg"},{"v":44252,"d":" 44 252"},{"v":30425,"d":" 30 425"},{"v":13827,"d":" 13 827"},{"v":9.077555816686251,"d":"9.1"},{"v":29.944409292235378,"d":"29.9"},{"v":25.601102775015818,"d":"25.6"},{"v":35.37693211606255,"d":"35.4"}]
[null,401,{"$f":"VLOOKUP(DAentabelle_C4[[#This Row],[Spalte1]],AGS_Namen!$C$1:$D$58,2,FALSE)","v":"Delmenhorst, Stadt"},{"v":1802,"d":" 1 802"},{"v":1145,"d":" 1 145"},{"v":657,"d":"  657"},{"v":9.32297447280799,"d":"9.3"},{"v":30.965593784683684,"d":"31.0"},{"v":28.85682574916759,"d":"28.9"},{"v":30.854605993340734,"d":"30.9"}]
[null,402,{"$f":"VLOOKUP(DAentabelle_C4[[#This Row],[Spalte1]],AGS_Namen!$C$1:$D$58,2,FALSE)","v":"Emden, Stadt"},{"v":1927,"d":" 1 927"},{"v":1437,"d":" 1 437"},{"v":490,"d":"  490"},{"v":9.237156201349247,"d":"9.2"},{"v":33.83497664763882,"d":"33.8"},{"v":26.466009340944474,"d":"26.5"},{"v":30.461857810067464,"d":"30.5"}]
[null,403,{"$f":"VLOOKUP(DAentabelle_C4[[#This Row],[Spalte1]],AGS_Namen!$C$1:$D$58,2,FALSE)","v":"Oldenburg (Oldb), Stadt"},{"v":5889,"d":" 5 889"},{"v":3809,"d":" 3 809"},{"v":2080,"d":" 2 080"},{"v":17.71098658515877,"d":"17.7"},{"v":24.961793173713705,"d":"25.0"},{"v":27.57683817286466,"d":"27.6"},{"v":29.750382068262862,"d":"29.8"}]
[null,404,{"$f":"VLOOKUP(DAentabelle_C4[[#This Row],[Spalte1]],AGS_Namen!$C$1:$D$58,2,FALSE)","v":"Osnabrück, Stadt"},{"v":8627,"d":" 8 627"},{"v":4905,"d":" 4 905"},{"v":3722,"d":" 3 722"},{"v":10.791700475252116,"d":"10.8"},{"v":29.500405703025386,"d":"29.5"},{"v":32.05053900544801,"d":"32.1"},{"v":27.657354816274488,"d":"27.7"}]
[null,405,{"$f":"VLOOKUP(DAentabelle_C4[[#This Row],[Spalte1]],AGS_Namen!$C$1:$D$58,2,FALSE)","v":"Wilhelmshaven, Stadt"},{"v":1637,"d":" 1 637"},{"v":1146,"d":" 1 146"},{"v":491,"d":"  491"},{"v":15.210751374465486,"d":"15.2"},{"v":29.138668295662796,"d":"29.1"},{"v":30.72693952351863,"d":"30.7"},{"v":24.923640806353085,"d":"24.9"}]
[null,451,{"$f":"VLOOKUP(DAentabelle_C4[[#This Row],[Spalte1]],AGS_Namen!$C$1:$D$58,2,FALSE)","v":"Ammerland"},{"v":3785,"d":" 3 785"},{"v":2613,"d":" 2 613"},{"v":1172,"d":" 1 172"},{"v":6.869220607661823,"d":"6.9"},{"v":26.18229854689564,"d":"26.2"},{"v":24.86129458388375,"d":"24.9"},{"v":42.087186261558784,"d":"42.1"}]
[null,452,{"$f":"VLOOKUP(DAentabelle_C4[[#This Row],[Spalte1]],AGS_Namen!$C$1:$D$58,2,FALSE)","v":"Aurich"},{"v":4363,"d":" 4 363"},{"v":2791,"d":" 2 791"},{"v":1572,"d":" 1 572"},{"v":8.18244327297731,"d":"8.2"},{"v":26.81641072656429,"d":"26.8"},{"v":26.335090534036215,"d":"26.3"},{"v":38.666055466422186,"d":"38.7"}]
[null,453,{"$f":"VLOOKUP(DAentabelle_C4[[#This Row],[Spalte1]],AGS_Namen!$C$1:$D$58,2,FALSE)","v":"Cloppenburg"},{"v":10030,"d":" 10 030"},{"v":6972,"d":" 6 972"},{"v":3058,"d":" 3 058"},{"v":3.1306081754735793,"d":"3.1"},{"v":20.508474576271187,"d":"20.5"},{"v":28.005982053838483,"d":"28.0"},{"v":48.35493519441675,"d":"48.4"}]
[null,454,{"$f":"VLOOKUP(DAentabelle_C4[[#This Row],[Spalte1]],AGS_Namen!$C$1:$D$58,2,FALSE)","v":"Emsland"},{"v":13916,"d":" 13 916"},{"v":10248,"d":" 10 248"},{"v":3668,"d":" 3 668"},{"v":6.618281115263007,"d":"6.6"},{"v":28.377407300948548,"d":"28.4"},{"v":19.186547858580052,"d":"19.2"},{"v":45.817763725208394,"d":"45.8"}]
[null,455,{"$f":"VLOOKUP(DAentabelle_C4[[#This Row],[Spalte1]],AGS_Namen!$C$1:$D$58,2,FALSE)","v":"Friesland"},{"v":1407,"d":" 1 407"},{"v":905,"d":"  905"},{"v":502,"d":"  502"},{"v":10.803127221037668,"d":"10.8"},{"v":30.063965884861407,"d":"30.1"},{"v":22.316986496090973,"d":"22.3"},{"v":36.81592039800995,"d":"36.8"}]
[null,456,{"$f":"VLOOKUP(DAentabelle_C4[[#This Row],[Spalte1]],AGS_Namen!$C$1:$D$58,2,FALSE)","v":"Grafschaft Bentheim"},{"v":5658,"d":" 5 658"},{"v":3875,"d":" 3 875"},{"v":1783,"d":" 1 783"},{"v":6.892895015906681,"d":"6.9"},{"v":37.34535171438671,"d":"37.3"},{"v":21.50936726758572,"d":"21.5"},{"v":34.25238600212089,"d":"34.3"}]
[null,457,{"$f":"VLOOKUP(DAentabelle_C4[[#This Row],[Spalte1]],AGS_Namen!$C$1:$D$58,2,FALSE)","v":"Leer"},{"v":3734,"d":" 3 734"},{"v":2680,"d":" 2 680"},{"v":1054,"d":" 1 054"},{"v":8.114622388859132,"d":"8.1"},{"v":29.539367970005355,"d":"29.5"},{"v":16.95232994108195,"d":"17.0"},{"v":45.39367970005356,"d":"45.4"}]
[null,458,{"$f":"VLOOKUP(DAentabelle_C4[[#This Row],[Spalte1]],AGS_Namen!$C$1:$D$58,2,FALSE)","v":"Oldenburg"},{"v":3710,"d":" 3 710"},{"v":2646,"d":" 2 646"},{"v":1064,"d":" 1 064"},{"v":4.420485175202156,"d":"4.4"},{"v":25.525606469002696,"d":"25.5"},{"v":27.035040431266847,"d":"27.0"},{"v":43.0188679245283,"d":"43.0"}]
[null,459,{"$f":"VLOOKUP(DAentabelle_C4[[#This Row],[Spalte1]],AGS_Namen!$C$1:$D$58,2,FALSE)","v":"Osnabrück"},{"v":17588,"d":" 17 588"},{"v":11759,"d":" 11 759"},{"v":5829,"d":" 5 829"},{"v":4.196042756424835,"d":"4.2"},{"v":22.174209688423925,"d":"22.2"},{"v":24.55651580623152,"d":"24.6"},{"v":49.07323174891972,"d":"49.1"}]
[null,460,{"$f":"VLOOKUP(DAentabelle_C4[[#This Row],[Spalte1]],AGS_Namen!$C$1:$D$58,2,FALSE)","v":"Vechta"},{"v":10720,"d":" 10 720"},{"v":7249,"d":" 7 249"},{"v":3471,"d":" 3 471"},{"v":4.412313432835821,"d":"4.4"},{"v":21.128731343283583,"d":"21.1"},{"v":27.40671641791045,"d":"27.4"},{"v":47.05223880597015,"d":"47.1"}]
[null,461,{"$f":"VLOOKUP(DAentabelle_C4[[#This Row],[Spalte1]],AGS_Namen!$C$1:$D$58,2,FALSE)","v":"Wesermarsch"},{"v":2489,"d":" 2 489"},{"v":2018,"d":" 2 018"},{"v":471,"d":"  471"},{"v":6.227400562474889,"d":"6.2"},{"v":35.074327038971475,"d":"35.1"},{"v":20.36962635596625,"d":"20.4"},{"v":38.32864604258739,"d":"38.3"}]
[null,462,{"$f":"VLOOKUP(DAentabelle_C4[[#This Row],[Spalte1]],AGS_Namen!$C$1:$D$58,2,FALSE)","v":"Wittmund"},{"v":988,"d":"  988"},{"v":577,"d":"  577"},{"v":411,"d":"  411"},{"v":5.870445344129554,"d":"5.9"},{"v":22.267206477732792,"d":"22.3"},{"v":18.62348178137652,"d":"18.6"},{"v":53.23886639676113,"d":"53.2"}]
[null,4,{"$f":"VLOOKUP(DAentabelle_C4[[#This Row],[Spalte1]],AGS_Namen!$C$1:$D$58,2,FALSE)","v":"Stat. Region Weser-Ems"},{"v":98270,"d":" 98 270"},{"v":66775,"d":" 66 775"},{"v":31495,"d":" 31 495"},{"v":6.974661646484177,"d":"7.0"},{"v":26.16566602218378,"d":"26.2"},{"v":25.039177775516436,"d":"25.0"},{"v":41.82049455581561,"d":"41.8"}]
[null,0,{"$f":"VLOOKUP(DAentabelle_C4[[#This Row],[Spalte1]],AGS_Namen!$C$1:$D$58,2,FALSE)","v":"Niedersachsen"},{"v":280719,"d":" 280 719"},{"v":186982,"d":" 186 982"},{"v":93737,"d":" 93 737"},{"v":11.298843327313078,"d":"11.3"},{"v":29.93883563278581,"d":"29.9"},{"v":25.28150926727439,"d":"25.3"},{"v":33.48081177262672,"d":"33.5"}]
[null,null,"1) Beschäftigte ohne Angabe der Qualifikation werden nicht aufgeführt; hoch = akademischer Abschluss (Bachelor, Diplom, Magister, Master, Staatsexamen, Promotion); mittel = Abschluss einer anerkannten Berufsausbildung , Meister-/Techniker- oder gleichwertiger Fachschulabschluss; niedrig = ohne abgeschlossene Berufsausbildung"]
[]
[]
[]
[null,null,"Quelle: Beschäftigungsstatistik der Bundesagentur für Arbeit"]
[]
[]
[null,null,"Karte C4-2: Anteil der sozialversicherungspflichtig beschäftigten Ausländerinnen und Ausländer mit hoher Qualifikation an allen sozialversicherungspflichtig beschäftigen Ausländerinnen und Ausländern am 30.06.2019 in Prozent"]
{"$rows_empty":40}
[null,null,{"$f":"Def","v":"Die Definition zu dem Indikator sowie methodische Hinweise finden Sie in der Tabelle Aktuelle Ergebnisse"}]
[null,null,"Link zur LSN-Online-Datenbank"]

{"sheet":"D2","index":21,"n_rows":132,"n_cols":8,"rows_kept":132,"merged":[[2,1,2,3],[4,1,4,10],[5,1,5,10],[8,1,11,1],[8,2,8,7],[9,2,9,4],[9,5,9,7],[11,2,11,4],[11,5,11,7],[70,1,70,7],[71,1,71,4],[72,1,72,4],[77,1,77,8],[131,1,131,9]]}
[null,{"$f":"Kopf","v":"Migration und Teilhabe in Niedersachsen - Integrationsmonitoring 2020 - Regionalinformationen "}]
[]
[]
[]
[null,"Indikator D2: Empfängerinnen und Empfänger von Mindestsicherungsleistungen"]
[null,"Tabelle D2-2: Empfängerinnen und Empfänger von Mindestsicherlungsleistungen1) nach Nationalität und Kreisen am 31.12.2018"]
[]
[]
[null,"Kreisfreie Stadt\nLandkreis\n(Großstadt, Umland)\nStatistische Region\nLand","Empfänger/-innen von Mindestsicherungsleistungen (SGB II + SGB XII + AsylbLG)1)"]
[null,null,"Empfänger/-innen",null,null,"je 1000 Einwohnerinnen und Einwohner der betreffenden Bevölkerungsgruppe"]
[null,null,"insgesamt2)","Deutsche","Ausländerinnen und Ausländer3)","insgesamt2)","Deutsche","Ausländerinnen und Ausländer3)"]
[null,null,"Anzahl",null,null,"Anzahl"]
[null,"1","2","3","4","5","6","7"]
[null,"Braunschweig, Stadt",{"v":21264,"d":" 21 264"},{"v":15270,"d":" 15 270"},{"v":5994,"d":" 5 994"},85,69,220]
[null,"Salzgitter, Stadt",{"v":15767,"d":" 15 767"},{"v":7962,"d":" 7 962"},{"v":7805,"d":" 7 805"},151,94,408]
[null,"Wolfsburg, Stadt",{"v":9979,"d":" 9 979"},{"v":5426,"d":" 5 426"},{"v":4553,"d":" 4 553"},80,52,234]
[null,"Gifhorn",{"v":10676,"d":" 10 676"},{"v":6814,"d":" 6 814"},{"v":3862,"d":" 3 862"},60,41,321]
[null,"Goslar",{"v":13864,"d":" 13 864"},{"v":9906,"d":" 9 906"},{"v":3958,"d":" 3 958"},102,81,291]
[null,"Helmstedt",{"v":7683,"d":" 7 683"},{"v":5573,"d":" 5 573"},{"v":2110,"d":" 2 110"},84,65,340]
[null,"Northeim",{"v":10655,"d":" 10 655"},{"v":7350,"d":" 7 350"},{"v":3305,"d":" 3 305"},81,59,387]
[null,"Peine",{"v":11270,"d":" 11 270"},{"v":7320,"d":" 7 320"},{"v":3950,"d":" 3 950"},84,59,375]
[null,"Wolfenbüttel",{"v":9118,"d":" 9 118"},{"v":6238,"d":" 6 238"},{"v":2880,"d":" 2 880"},76,56,397]
[null,"Göttingen",{"v":25835,"d":" 25 835"},{"v":17778,"d":" 17 778"},{"v":8057,"d":" 8 057"},79,60,284]
[null,"   dav. Göttingen, Stadt",{"v":12893,"d":" 12 893"},{"v":8158,"d":" 8 158"},{"v":4735,"d":" 4 735"},108,80,277]
[null,"   dav. Göttingen, Umland",{"v":12942,"d":" 12 942"},{"v":9620,"d":" 9 620"},{"v":3322,"d":" 3 322"},62,49,294]
[null,"Stat. Region Braunschweig",{"v":136111,"d":" 136 111"},{"v":89637,"d":" 89 637"},{"v":46474,"d":" 46 474"},85,62,305]
[null,"Hannover, Region",{"v":136038,"d":" 136 038"},{"v":76107,"d":" 76 107"},{"v":59931,"d":" 59 931"},118,77,369]
[null,"   dav. Hannover, Lhst.",{"v":79330,"d":" 79 330"},{"v":44632,"d":" 44 632"},{"v":34698,"d":" 34 698"},148,101,358]
[null,"   dav. Hannover, Umland",{"v":56708,"d":" 56 708"},{"v":31475,"d":" 31 475"},{"v":25233,"d":" 25 233"},91,57,386]
[null,"Diepholz",{"v":15107,"d":" 15 107"},{"v":8972,"d":" 8 972"},{"v":6135,"d":" 6 135"},70,45,336]
[null,"Hameln-Pyrmont",{"v":16030,"d":" 16 030"},{"v":9581,"d":" 9 581"},{"v":6449,"d":" 6 449"},108,72,412]
[null,"Hildesheim",{"v":25087,"d":" 25 087"},{"v":16477,"d":" 16 477"},{"v":8610,"d":" 8 610"},91,65,372]
[null,"Hildesheim, Stadt",{"v":15136,"d":" 15 136"},{"v":9573,"d":" 9 573"},{"v":5563,"d":" 5 563"},149,109,413]
[null,"Hildesheim, Umland",{"v":9951,"d":" 9 951"},{"v":6904,"d":" 6 904"},{"v":3047,"d":" 3 047"},57,42,315]
[null,"Holzminden",{"v":6318,"d":" 6 318"},{"v":4652,"d":" 4 652"},{"v":1666,"d":" 1 666"},90,71,321]
[null,"Nienburg (Weser)",{"v":11106,"d":" 11 106"},{"v":7048,"d":" 7 048"},{"v":4058,"d":" 4 058"},91,63,411]
[null,"Schaumburg",{"v":13489,"d":" 13 489"},{"v":8336,"d":" 8 336"},{"v":5153,"d":" 5 153"},85,58,378]
[null,"Stat. Region Hannover",{"v":223175,"d":" 223 175"},{"v":131173,"d":" 131 173"},{"v":92002,"d":" 92 002"},104,69,371]
[null,"Celle",{"v":17521,"d":" 17 521"},{"v":12259,"d":" 12 259"},{"v":5262,"d":" 5 262"},98,74,373]
[null,"Cuxhaven",{"v":14334,"d":" 14 334"},{"v":10081,"d":" 10 081"},{"v":4253,"d":" 4 253"},72,54,340]
[null,"Harburg",{"v":14521,"d":" 14 521"},{"v":9082,"d":" 9 082"},{"v":5439,"d":" 5 439"},57,39,272]
[null,"Lüchow-Dannenberg",{"v":4439,"d":" 4 439"},{"v":3643,"d":" 3 643"},{"v":796,"d":"  796"},92,80,288]
[null,"Lüneburg",{"v":15232,"d":" 15 232"},{"v":10172,"d":" 10 172"},{"v":5060,"d":" 5 060"},83,59,403]
[null,"Osterholz",{"v":5813,"d":" 5 813"},{"v":3680,"d":" 3 680"},{"v":2133,"d":" 2 133"},51,34,333]
[null,"Rotenburg (Wümme)",{"v":9161,"d":" 9 161"},{"v":6333,"d":" 6 333"},{"v":2828,"d":" 2 828"},56,41,265]
[null,"Heidekreis",{"v":10796,"d":" 10 796"},{"v":7872,"d":" 7 872"},{"v":2924,"d":" 2 924"},77,61,231]
[null,"Stade",{"v":16915,"d":" 16 915"},{"v":10749,"d":" 10 749"},{"v":6166,"d":" 6 166"},83,58,341]
[null,"Uelzen",{"v":6620,"d":" 6 620"},{"v":4876,"d":" 4 876"},{"v":1744,"d":" 1 744"},72,56,318]
[null,"Verden",{"v":9114,"d":" 9 114"},{"v":5666,"d":" 5 666"},{"v":3448,"d":" 3 448"},66,45,330]
[null,"Stat. Region Lüneburg",{"v":124466,"d":" 124 466"},{"v":84413,"d":" 84 413"},{"v":40053,"d":" 40 053"},73,53,319]
[null,"Delmenhorst, Stadt",{"v":12501,"d":" 12 501"},{"v":7101,"d":" 7 101"},{"v":5400,"d":" 5 400"},161,109,435]
[null,"Emden, Stadt",{"v":6719,"d":" 6 719"},{"v":4838,"d":" 4 838"},{"v":1881,"d":" 1 881"},135,108,368]
[null,"Oldenburg (Oldb), Stadt",{"v":19714,"d":" 19 714"},{"v":12741,"d":" 12 741"},{"v":6973,"d":" 6 973"},117,84,400]
[null,"Osnabrück, Stadt",{"v":19047,"d":" 19 047"},{"v":11356,"d":" 11 356"},{"v":7691,"d":" 7 691"},115,79,346]
[null,"Wilhelmshaven, Stadt",{"v":12637,"d":" 12 637"},{"v":8733,"d":" 8 733"},{"v":3904,"d":" 3 904"},166,127,526]
[null,"Ammerland",{"v":7457,"d":" 7 457"},{"v":4792,"d":" 4 792"},{"v":2665,"d":" 2 665"},60,41,342]
[null,"Aurich",{"v":15980,"d":" 15 980"},{"v":12424,"d":" 12 424"},{"v":3556,"d":" 3 556"},84,69,341]
[null,"Cloppenburg",{"v":9940,"d":" 9 940"},{"v":6857,"d":" 6 857"},{"v":3083,"d":" 3 083"},58,45,162]
[null,"Emsland",{"v":16956,"d":" 16 956"},{"v":11281,"d":" 11 281"},{"v":5675,"d":" 5 675"},52,39,154]
[null,"Friesland",{"v":6336,"d":" 6 336"},{"v":4463,"d":" 4 463"},{"v":1873,"d":" 1 873"},64,47,450]
[null,"Grafschaft Bentheim",{"v":7959,"d":" 7 959"},{"v":4973,"d":" 4 973"},{"v":2986,"d":" 2 986"},58,43,146]
[null,"Leer",{"v":11879,"d":" 11 879"},{"v":8043,"d":" 8 043"},{"v":3836,"d":" 3 836"},70,51,265]
[null,"Oldenburg",{"v":7274,"d":" 7 274"},{"v":4518,"d":" 4 518"},{"v":2756,"d":" 2 756"},56,38,247]
[null,"Osnabrück",{"v":16307,"d":" 16 307"},{"v":11410,"d":" 11 410"},{"v":4897,"d":" 4 897"},46,35,163]
[null,"Vechta",{"v":8535,"d":" 8 535"},{"v":4194,"d":" 4 194"},{"v":4341,"d":" 4 341"},60,34,235]
[null,"Wesermarsch",{"v":8025,"d":" 8 025"},{"v":5668,"d":" 5 668"},{"v":2357,"d":" 2 357"},91,70,332]
[null,"Wittmund",{"v":3850,"d":" 3 850"},{"v":2979,"d":" 2 979"},{"v":871,"d":"  871"},68,55,333]
[null,"Stat. Region Weser-Ems",{"v":191116,"d":" 191 116"},{"v":126371,"d":" 126 371"},{"v":64745,"d":" 64 745"},75,55,262]
[null,"Niedersachsen",{"v":674868,"d":" 674 868"},{"v":431594,"d":" 431 594"},{"v":243274,"d":" 243 274"},84,60,315]
[]
[null,"1) SGB II: erwerbsfähige Leistungsberechtigte und nicht erwerbsfähige Leistungsberechtigte. Von der Bundesagentur für Arbeit wurde im April 2016 die SGB-II-Statistik revidiert, und zwar rückwirkend. Es kann daher zu geringfügigen Abweichungen zu Veröffentlichungen der BA kommen.\nSGB XII: Hilfe zum Lebensunterhalt außerhalb von Einrichtungen (HLU, nach Wohnort); Grundsicherung im Alter und bei Erwerbsminderung nach Wohnort der Bedarfsgemeinschaft, in- und außerhalb von Einrichtungen.\nRegelleistungen nach dem Asylbewerberleistungsgesetz (örtliche Träger, nach Wohnort)."]
[null,"2) Einschließlich \"keine Zuordnung möglich\"."]
[null,"3) Einschließlich \"ohne Angabe\", \"ungeklärt\", \"staatenlos\", \"unbekanntes Ausland\"."]
[]
[null,"Quellen: Leistungen nach SGB II: Statistik der Bundesagentur für Arbeit, alle weiteren Daten: Statistische Ämter des Bundes und der Länder. Eigene Berechnung LSN."]
[]
[]
[null,"Karte D2-2: Ausländische Empfängerinnen und Empfänger von Mindestsicherungsleistungen am 31.12.2019 je 1 000 Ausländerinnen und Ausländer"]
{"$rows_empty":52}
[null,{"$f":"Def","v":"Die Definition zu dem Indikator sowie methodische Hinweise finden Sie in der Tabelle Aktuelle Ergebnisse"}]
[null,"Link zur LSN-Online-Datenbank"]

{"sheet":"D3","index":22,"n_rows":128,"n_cols":11,"rows_kept":128,"merged":[[2,1,2,3],[4,1,4,10],[5,1,5,10],[7,1,10,1],[7,2,7,10],[8,2,8,4],[8,5,8,7],[8,8,8,10],[10,2,10,10],[69,1,69,10],[74,1,74,9],[127,1,127,9]]}
[null,{"$f":"Kopf","v":"Migration und Teilhabe in Niedersachsen - Integrationsmonitoring 2020 - Regionalinformationen "}]
[]
[]
[]
[null,"Indikator D3: Empfängerinnen und Empfänger von Mindestsicherungsleistungen nach Altersgruppen"]
[null,"Tabelle D3-2: Empfängerinnen und Empfänger von Mindestsicherungsleistungen1) nach Nationalität, Altersgruppen und Kreisen am 31.12.2018"]
[]
[null,"Kreisfreie Stadt\nLandkreis\n(Großstadt, Umland)\nStatistische Region\nLand","Empfänger/-innen von Mindestsicherungsleistungen (SGB II + SGB XII + AsylbLG)1)"]
[null,null,"Insgesamt",null,null,"Deutsche",null,null,"Ausländerinnen und Ausländer"]
[null,null,"im Alter bis unter 18 Jahren","im Alter von 18 bis unter 65 Jahren","im Alter von 65 Jahren und älter","im Alter bis unter 18 Jahren","im Alter von 18 bis unter 65 Jahren","im Alter von 65 Jahren und älter","im Alter bis unter 18 Jahren","im Alter von 18 bis unter 65 Jahren","im Alter von 65 Jahren und älter"]
[null,null,"Anzahl je 1 000 Einwohner/-innen der betreffenden Bevölkerungsgruppe"]
[null,"1","2","3","4","5","6","7","8","9","10"]
[null,"Braunschweig, Stadt",131,89,41,103,73,34,412,193,203]
[null,"Salzgitter, Stadt",268,158,41,150,106,31,639,352,190]
[null,"Wolfsburg, Stadt",139,84,25,84,56,18,460,202,115]
[null,"Gifhorn",94,64,20,58,45,17,572,274,133]
[null,"Goslar",186,114,35,127,96,31,590,238,157]
[null,"Helmstedt",133,95,25,91,77,22,579,294,161]
[null,"Northeim",140,89,26,91,69,21,604,335,231]
[null,"Peine",151,85,23,104,61,19,602,323,207]
[null,"Wolfenbüttel",128,82,29,80,62,26,694,337,166]
[null,"Göttingen",124,85,33,82,67,27,518,238,230]
[null,"   dav. Göttingen, Stadt",180,108,57,118,83,45,513,229,299]
[null,"   dav. Göttingen, Umland",96,70,23,66,58,19,525,251,168]
[null,"Stat. Region Braunschweig",142,91,31,93,69,25,555,258,183]
[null,"Hannover, Region",200,117,54,130,77,36,635,316,323]
[null,"   dav. Hannover, Lhst.",248,142,86,177,97,55,613,311,347]
[null,"   dav. Hannover, Umland",163,94,33,95,60,23,659,324,277]
[null,"Diepholz",129,69,26,70,48,22,579,265,251]
[null,"Hameln-Pyrmont",202,114,36,119,81,26,664,351,243]
[null,"Hildesheim",153,99,29,101,73,24,595,330,206]
[null,"Hildesheim, Stadt",258,157,50,180,119,40,634,371,253]
[null,"Hildesheim, Umland",94,63,18,61,48,15,541,274,146]
[null,"Holzminden",161,99,29,114,82,27,575,277,94]
[null,"Nienburg (Weser)",173,92,30,104,68,24,688,325,284]
[null,"Schaumburg",152,92,28,92,64,24,642,332,164]
[null,"Stat. Region Hannover",181,106,42,114,73,30,630,316,289]
[null,"Celle",161,104,37,111,83,30,587,315,260]
[null,"Cuxhaven",133,78,21,89,61,20,643,280,103]
[null,"Harburg",86,61,23,62,39,20,416,258,120]
[null,"Lüchow-Dannenberg",136,110,31,106,99,30,456,249,120]
[null,"Lüneburg",134,85,34,83,63,29,692,334,239]
[null,"Osterholz",87,53,21,47,37,18,549,270,227]
[null,"Rotenburg (Wümme)",79,59,28,47,46,25,463,221,155]
[null,"Heidekreis",122,82,29,95,68,23,333,197,276]
[null,"Stade",149,84,25,96,60,22,577,283,158]
[null,"Uelzen",116,80,26,79,65,23,509,266,225]
[null,"Verden",113,69,23,71,48,18,561,276,239]
[null,"Stat. Region Lüneburg",120,77,27,80,58,23,533,270,188]
[null,"Delmenhorst, Stadt",263,167,62,179,117,44,562,395,388]
[null,"Emden, Stadt",232,140,43,171,118,40,586,309,166]
[null,"Oldenburg (Oldb), Stadt",208,115,49,137,86,40,632,338,339]
[null,"Osnabrück, Stadt",197,112,63,135,78,43,522,298,414]
[null,"Wilhelmshaven, Stadt",301,185,48,205,151,42,709,465,322]
[null,"Ammerland",103,62,23,58,45,20,586,268,244]
[null,"Aurich",136,93,25,110,77,22,483,308,229]
[null,"Cloppenburg",85,57,32,58,46,28,291,123,248]
[null,"Emsland",70,55,24,40,44,23,290,127,68]
[null,"Friesland",119,69,21,74,54,19,665,381,221]
[null,"Grafschaft Bentheim",86,61,25,55,46,22,272,134,51]
[null,"Leer",102,76,25,60,60,22,473,222,105]
[null,"Oldenburg",98,54,26,51,40,23,499,178,243]
[null,"Osnabrück",65,47,25,43,37,21,288,132,164]
[null,"Vechta",97,55,32,45,33,25,385,185,277]
[null,"Wesermarsch",164,95,31,114,76,28,574,277,160]
[null,"Wittmund",110,74,25,79,62,23,554,274,193]
[null,"Stat. Region Weser-Ems",119,78,32,77,60,27,439,218,192]
[null,"Niedersachsen",140,88,33,90,65,26,534,266,227]
[]
[null,"1) SGB II: erwerbsfähige Leistungsberechtigte und nicht erwerbsfähige Leistungsberechtigte. SGB XII: Hilfe zum Lebensunterhalt außerhalb von Einrichtungen (HLU, nach Wohnort); Grundsicherung im Alter und bei Erwerbsminderung nach Wohnort der Bedarfsgemeinschaft, in- und außerhalb von Einrichtungen. Regelleistungen nach dem Asylbewerberleistungsgesetz (örtliche Träger, nach Wohnort)."]
[]
[null,"Quellen: Leistungen nach SGB II: Statistik der Bundesagentur für Arbeit, alle weiteren Daten: Statistische Ämter des Bundes und der Länder. Eigene Berechnung LSN."]
[]
[]
[null,"Karte D3-2: Ausländische Empfängerinnen und Empfänger von Mindestsicherungsleistungen im Alter von unter 18 Jahren am 31.12.2019 je 1 000 Ausländerinnen und Ausländer der betreffenden Altersgruppe"]
{"$rows_empty":51}
[null,{"$f":"Def","v":"Die Definition zu dem Indikator sowie methodische Hinweise finden Sie in der Tabelle Aktuelle Ergebnisse"}]
[null,"Link zur LSN-Online-Datenbank"]